BDBM50156742 CHEMBL222098::N-methoxy-4-methyl-3-(4-(methyl(neopentyl)amino)-6-(4-methylpiperazin-1-yl)-1,3,5-triazin-2-ylamino)benzamide
SMILES: CONC(=O)c1ccc(C)c(Nc2nc(nc(n2)N2CCN(C)CC2)N(C)CC(C)(C)C)c1
InChI Key: InChIKey=NEWYDBNQBPEMGO-UHFFFAOYSA-N
Data: 1 IC50
Activity Spreadsheet -- Enzyme Inhibition Constant Data from BindingDB
Found 1 hit for monomerid = 50156742
Trg + Lig
Ki
nM
ΔG°
kcal/mole
IC50
nM
Kd
nM
EC50/IC50
nM
koff
s-1
kon
M-1s-1
pHTemp
°C
Mitogen-activated protein kinase 14
(Homo sapiens (Human))
BDBM50156742
(CHEMBL222098 | N-methoxy-4-methyl-3-(4-(methyl(neo...)
Show SMILES CONC(=O)c1ccc(C)c(Nc2nc(nc(n2)N2CCN(C)CC2)N(C)CC(C)(C)C)c1
Show InChI InChI=1S/C23H36N8O2/c1-16-8-9-17(19(32)28-33-7)14-18(16)24-20-25-21(30(6)15-23(2,3)4)27-22(26-20)31-12-10-29(5)11-13-31/h8-9,14H,10-13,15H2,1-7H3,(H,28,32)(H,24,25,26,27)
NCI pathway
Reactome pathway
n/an/a 57n/an/an/an/an/an/a
Bristol-Myers Squibb
Curated by ChEMBL
Assay Description
Inhibition of human p38-alpha expressed in Escherichia coli
J Med Chem 47: 6283-91 (2004)
Article DOI: 10.1021/jm049521d
BindingDB Entry DOI: 10.7270/Q2WS8SR1