BDBM50156752 3-(4-(((1S,2R,5S)-6,6-dimethylbicyclo[3.1.1]heptan-2-yl)methylamino)-6-((S)-pyrrolidin-3-ylamino)-1,3,5-triazin-2-ylamino)-4-methylbenzamide::CHEMBL224956
SMILES: Cc1ccc(cc1Nc1nc(NC[C@@H]2CC[C@H]3C[C@@H]2C3(C)C)nc(N[C@H]2CCNC2)n1)C(N)=O
InChI Key: InChIKey=SPEWOUCEHPGLAZ-VJANTYMQSA-N
Data: 1 IC50
Activity Spreadsheet -- Enzyme Inhibition Constant Data from BindingDB
Found 1 hit for monomerid = 50156752
Trg + Lig
Ki
nM
ΔG°
kcal/mole
IC50
nM
Kd
nM
EC50/IC50
nM
koff
s-1
kon
M-1s-1
pHTemp
°C
Mitogen-activated protein kinase 14
(Homo sapiens (Human))
BDBM50156752
(3-(4-(((1S,2R,5S)-6,6-dimethylbicyclo[3.1.1]heptan...)
Show SMILES Cc1ccc(cc1Nc1nc(NC[C@@H]2CC[C@H]3C[C@@H]2C3(C)C)nc(N[C@H]2CCNC2)n1)C(N)=O |r|
Show InChI InChI=1S/C25H36N8O/c1-14-4-5-15(21(26)34)10-20(14)30-24-32-22(31-23(33-24)29-18-8-9-27-13-18)28-12-16-6-7-17-11-19(16)25(17,2)3/h4-5,10,16-19,27H,6-9,11-13H2,1-3H3,(H2,26,34)(H3,28,29,30,31,32,33)/t16-,17-,18-,19-/m0/s1
NCI pathway
Reactome pathway
n/an/a 53n/an/an/an/an/an/a
Bristol-Myers Squibb
Curated by ChEMBL
Assay Description
Inhibition of human p38-alpha expressed in Escherichia coli
J Med Chem 47: 6283-91 (2004)
Article DOI: 10.1021/jm049521d
BindingDB Entry DOI: 10.7270/Q2WS8SR1