null
SMILES: CCOCCn1cc(C2CCN(CCOc3ccccc3C(O)=O)CC2)c2cccc(Br)c12
InChI Key: InChIKey=QWQRGXJHFQEOOM-UHFFFAOYSA-N
Activity Spreadsheet -- Enzyme Inhibition Constant Data from BindingDB
Found 2 hits for monomerid = 50156860
Trg + Lig
Ki
nM
ΔG°
kcal/mole
IC50
nM
Kd
nM
EC50/IC50
nM
koff
s-1
kon
M-1s-1
pHTemp
°C
Histamine H2 receptor
(Homo sapiens (Human))
BDBM50156860
(2-(2-(4-(7-bromo-1-(2-ethoxyethyl)-1H-indol-3-yl)p...)
Show SMILES CCOCCn1cc(C2CCN(CCOc3ccccc3C(O)=O)CC2)c2cccc(Br)c12
Show InChI InChI=1S/C26H31BrN2O4/c1-2-32-16-15-29-18-22(20-7-5-8-23(27)25(20)29)19-10-12-28(13-11-19)14-17-33-24-9-4-3-6-21(24)26(30)31/h3-9,18-19H,2,10-17H2,1H3,(H,30,31)
Reactome pathway
n/an/a 1.40E+3n/an/an/an/an/an/a
Rhône-Poulenc Rorer
Curated by ChEMBL
Assay Description
Displacement of [3H]ketanserine from histamine H2 receptor in human cortex membranes
J Med Chem 47: 6326-37 (2004)
Article DOI: 10.1021/jm0498203
BindingDB Entry DOI: 10.7270/Q2HM57XC
Histamine H1 receptor
(Cavia porcellus (domestic guinea pig))
BDBM50156860
(2-(2-(4-(7-bromo-1-(2-ethoxyethyl)-1H-indol-3-yl)p...)
Show SMILES CCOCCn1cc(C2CCN(CCOc3ccccc3C(O)=O)CC2)c2cccc(Br)c12
Show InChI InChI=1S/C26H31BrN2O4/c1-2-32-16-15-29-18-22(20-7-5-8-23(27)25(20)29)19-10-12-28(13-11-19)14-17-33-24-9-4-3-6-21(24)26(30)31/h3-9,18-19H,2,10-17H2,1H3,(H,30,31)
n/an/a 80n/an/an/an/an/an/a
Rhône-Poulenc Rorer
Curated by ChEMBL
Assay Description
Displacement of [3H]mepyramine from histamine H1 receptor in guinea pig cerebellum membranes
J Med Chem 47: 6326-37 (2004)
Article DOI: 10.1021/jm0498203
BindingDB Entry DOI: 10.7270/Q2HM57XC