null
SMILES: OC(=O)c1ccccc1OCCN1CCC(CC1)c1cn(Cc2ccc(Cl)s2)c2cc(F)ccc12
InChI Key: InChIKey=XKAJSRFEDJSVQV-UHFFFAOYSA-N
Activity Spreadsheet -- Enzyme Inhibition Constant Data from BindingDB
Found 2 hits for monomerid = 50156861
Trg + Lig
Ki
nM
ΔG°
kcal/mole
IC50
nM
Kd
nM
EC50/IC50
nM
koff
s-1
kon
M-1s-1
pHTemp
°C
Histamine H2 receptor
(Homo sapiens (Human))
BDBM50156861
(2-(2-(4-(1-((5-chlorothiophen-2-yl)methyl)-6-fluor...)
Show SMILES OC(=O)c1ccccc1OCCN1CCC(CC1)c1cn(Cc2ccc(Cl)s2)c2cc(F)ccc12
Show InChI InChI=1S/C27H26ClFN2O3S/c28-26-8-6-20(35-26)16-31-17-23(21-7-5-19(29)15-24(21)31)18-9-11-30(12-10-18)13-14-34-25-4-2-1-3-22(25)27(32)33/h1-8,15,17-18H,9-14,16H2,(H,32,33)
Reactome pathway
n/an/a 1.03E+3n/an/an/an/an/an/a
Rhône-Poulenc Rorer
Curated by ChEMBL
Assay Description
Displacement of [3H]ketanserine from histamine H2 receptor in human cortex membranes
J Med Chem 47: 6326-37 (2004)
Article DOI: 10.1021/jm0498203
BindingDB Entry DOI: 10.7270/Q2HM57XC
Histamine H1 receptor
(Cavia porcellus (domestic guinea pig))
BDBM50156861
(2-(2-(4-(1-((5-chlorothiophen-2-yl)methyl)-6-fluor...)
Show SMILES OC(=O)c1ccccc1OCCN1CCC(CC1)c1cn(Cc2ccc(Cl)s2)c2cc(F)ccc12
Show InChI InChI=1S/C27H26ClFN2O3S/c28-26-8-6-20(35-26)16-31-17-23(21-7-5-19(29)15-24(21)31)18-9-11-30(12-10-18)13-14-34-25-4-2-1-3-22(25)27(32)33/h1-8,15,17-18H,9-14,16H2,(H,32,33)
n/an/a 28n/an/an/an/an/an/a
Rhône-Poulenc Rorer
Curated by ChEMBL
Assay Description
Displacement of [3H]mepyramine from histamine H1 receptor in guinea pig cerebellum membranes
J Med Chem 47: 6326-37 (2004)
Article DOI: 10.1021/jm0498203
BindingDB Entry DOI: 10.7270/Q2HM57XC