null
SMILES: CCOCCn1cc(C2CCN(Cc3cccc(c3)C(O)=O)CC2)c2cc(OC)ccc12
InChI Key: InChIKey=OFHIEGLAJRURRH-UHFFFAOYSA-N
Activity Spreadsheet -- Enzyme Inhibition Constant Data from BindingDB
Found 2 hits for monomerid = 50156868
Trg + Lig
Ki
nM
ΔG°
kcal/mole
IC50
nM
Kd
nM
EC50/IC50
nM
koff
s-1
kon
M-1s-1
pHTemp
°C
Histamine H1 receptor
(Cavia porcellus (domestic guinea pig))
BDBM50156868
(3-{4-[1-(2-ethoxyethyl)-5-methoxy-1H-indol-3-yl]pi...)
Show SMILES CCOCCn1cc(C2CCN(Cc3cccc(c3)C(O)=O)CC2)c2cc(OC)ccc12
Show InChI InChI=1S/C26H32N2O4/c1-3-32-14-13-28-18-24(23-16-22(31-2)7-8-25(23)28)20-9-11-27(12-10-20)17-19-5-4-6-21(15-19)26(29)30/h4-8,15-16,18,20H,3,9-14,17H2,1-2H3,(H,29,30)
n/an/a 500n/an/an/an/an/an/a
Rhône-Poulenc Rorer
Curated by ChEMBL
Assay Description
Displacement of [3H]mepyramine from histamine H1 receptor in guinea pig cerebellum membranes
J Med Chem 47: 6326-37 (2004)
Article DOI: 10.1021/jm0498203
BindingDB Entry DOI: 10.7270/Q2HM57XC
Histamine H2 receptor
(Homo sapiens (Human))
BDBM50156868
(3-{4-[1-(2-ethoxyethyl)-5-methoxy-1H-indol-3-yl]pi...)
Show SMILES CCOCCn1cc(C2CCN(Cc3cccc(c3)C(O)=O)CC2)c2cc(OC)ccc12
Show InChI InChI=1S/C26H32N2O4/c1-3-32-14-13-28-18-24(23-16-22(31-2)7-8-25(23)28)20-9-11-27(12-10-20)17-19-5-4-6-21(15-19)26(29)30/h4-8,15-16,18,20H,3,9-14,17H2,1-2H3,(H,29,30)
Reactome pathway
n/an/a>1.00E+4n/an/an/an/an/an/a
Rhône-Poulenc Rorer
Curated by ChEMBL
Assay Description
Displacement of [3H]ketanserine from histamine H2 receptor in human cortex membranes
J Med Chem 47: 6326-37 (2004)
Article DOI: 10.1021/jm0498203
BindingDB Entry DOI: 10.7270/Q2HM57XC