null
SMILES: COc1ccc(CN2CCC(CC2)c2cn(Cc3ccoc3)c3cc(F)ccc23)cc1C(O)=O
InChI Key: InChIKey=PLADVISFXRAPMA-UHFFFAOYSA-N
Activity Spreadsheet -- Enzyme Inhibition Constant Data from BindingDB
Found 2 hits for monomerid = 50156877
Trg + Lig
Ki
nM
ΔG°
kcal/mole
IC50
nM
Kd
nM
EC50/IC50
nM
koff
s-1
kon
M-1s-1
pHTemp
°C
Histamine H1 receptor
(Cavia porcellus (domestic guinea pig))
BDBM50156877
(5-[4-(6-fluoro-1-furan-3-ylmethyl-1H-indol-3-yl)pi...)
Show SMILES COc1ccc(CN2CCC(CC2)c2cn(Cc3ccoc3)c3cc(F)ccc23)cc1C(O)=O
Show InChI InChI=1S/C27H27FN2O4/c1-33-26-5-2-18(12-23(26)27(31)32)14-29-9-6-20(7-10-29)24-16-30(15-19-8-11-34-17-19)25-13-21(28)3-4-22(24)25/h2-5,8,11-13,16-17,20H,6-7,9-10,14-15H2,1H3,(H,31,32)
n/an/a 96n/an/an/an/an/an/a
Rhône-Poulenc Rorer
Curated by ChEMBL
Assay Description
Displacement of [3H]mepyramine from histamine H1 receptor in guinea pig cerebellum membranes
J Med Chem 47: 6326-37 (2004)
Article DOI: 10.1021/jm0498203
BindingDB Entry DOI: 10.7270/Q2HM57XC
Histamine H2 receptor
(Homo sapiens (Human))
BDBM50156877
(5-[4-(6-fluoro-1-furan-3-ylmethyl-1H-indol-3-yl)pi...)
Show SMILES COc1ccc(CN2CCC(CC2)c2cn(Cc3ccoc3)c3cc(F)ccc23)cc1C(O)=O
Show InChI InChI=1S/C27H27FN2O4/c1-33-26-5-2-18(12-23(26)27(31)32)14-29-9-6-20(7-10-29)24-16-30(15-19-8-11-34-17-19)25-13-21(28)3-4-22(24)25/h2-5,8,11-13,16-17,20H,6-7,9-10,14-15H2,1H3,(H,31,32)
Reactome pathway
n/an/a 1.50E+3n/an/an/an/an/an/a
Rhône-Poulenc Rorer
Curated by ChEMBL
Assay Description
Displacement of [3H]ketanserine from histamine H2 receptor in human cortex membranes
J Med Chem 47: 6326-37 (2004)
Article DOI: 10.1021/jm0498203
BindingDB Entry DOI: 10.7270/Q2HM57XC