null
SMILES: OC(=O)c1cccc(CN2CCC(CC2)c2cn(Cc3ccco3)c3ccccc23)c1
InChI Key: InChIKey=ZZMRJEDGNAGSCT-UHFFFAOYSA-N
Activity Spreadsheet -- Enzyme Inhibition Constant Data from BindingDB
Found 2 hits for monomerid = 50156887
Trg + Lig
Ki
nM
ΔG°
kcal/mole
IC50
nM
Kd
nM
EC50/IC50
nM
koff
s-1
kon
M-1s-1
pHTemp
°C
Histamine H2 receptor
(Homo sapiens (Human))
BDBM50156887
(3-[4-(1-furan-2-ylmethyl-1H-indol-3-yl)piperidin-1...)
Show SMILES OC(=O)c1cccc(CN2CCC(CC2)c2cn(Cc3ccco3)c3ccccc23)c1
Show InChI InChI=1S/C26H26N2O3/c29-26(30)21-6-3-5-19(15-21)16-27-12-10-20(11-13-27)24-18-28(17-22-7-4-14-31-22)25-9-2-1-8-23(24)25/h1-9,14-15,18,20H,10-13,16-17H2,(H,29,30)
Reactome pathway
n/an/a 630n/an/an/an/an/an/a
Rhône-Poulenc Rorer
Curated by ChEMBL
Assay Description
Displacement of [3H]ketanserine from histamine H2 receptor in human cortex membranes
J Med Chem 47: 6326-37 (2004)
Article DOI: 10.1021/jm0498203
BindingDB Entry DOI: 10.7270/Q2HM57XC
Histamine H1 receptor
(Cavia porcellus (domestic guinea pig))
BDBM50156887
(3-[4-(1-furan-2-ylmethyl-1H-indol-3-yl)piperidin-1...)
Show SMILES OC(=O)c1cccc(CN2CCC(CC2)c2cn(Cc3ccco3)c3ccccc23)c1
Show InChI InChI=1S/C26H26N2O3/c29-26(30)21-6-3-5-19(15-21)16-27-12-10-20(11-13-27)24-18-28(17-22-7-4-14-31-22)25-9-2-1-8-23(24)25/h1-9,14-15,18,20H,10-13,16-17H2,(H,29,30)
n/an/a 87n/an/an/an/an/an/a
Rhône-Poulenc Rorer
Curated by ChEMBL
Assay Description
Displacement of [3H]mepyramine from histamine H1 receptor in guinea pig cerebellum membranes
J Med Chem 47: 6326-37 (2004)
Article DOI: 10.1021/jm0498203
BindingDB Entry DOI: 10.7270/Q2HM57XC