null
SMILES: CCOCCn1cc(C2CCN(CCOc3ccc(cc3C(O)=O)C(C)=O)CC2)c2ccccc12
InChI Key: InChIKey=UXOIIHIYVLNWQF-UHFFFAOYSA-N
Activity Spreadsheet -- Enzyme Inhibition Constant Data from BindingDB
Found 2 hits for monomerid = 50156890
Trg + Lig
Ki
nM
ΔG°
kcal/mole
IC50
nM
Kd
nM
EC50/IC50
nM
koff
s-1
kon
M-1s-1
pHTemp
°C
Histamine H2 receptor
(Homo sapiens (Human))
BDBM50156890
(5-acetyl-2-(2-(4-(1-(2-ethoxyethyl)-1H-indol-3-yl)...)
Show SMILES CCOCCn1cc(C2CCN(CCOc3ccc(cc3C(O)=O)C(C)=O)CC2)c2ccccc12
Show InChI InChI=1S/C28H34N2O5/c1-3-34-16-15-30-19-25(23-6-4-5-7-26(23)30)21-10-12-29(13-11-21)14-17-35-27-9-8-22(20(2)31)18-24(27)28(32)33/h4-9,18-19,21H,3,10-17H2,1-2H3,(H,32,33)
Reactome pathway
n/an/a 950n/an/an/an/an/an/a
Rhône-Poulenc Rorer
Curated by ChEMBL
Assay Description
Displacement of [3H]ketanserine from histamine H2 receptor in human cortex membranes
J Med Chem 47: 6326-37 (2004)
Article DOI: 10.1021/jm0498203
BindingDB Entry DOI: 10.7270/Q2HM57XC
Histamine H1 receptor
(Cavia porcellus (domestic guinea pig))
BDBM50156890
(5-acetyl-2-(2-(4-(1-(2-ethoxyethyl)-1H-indol-3-yl)...)
Show SMILES CCOCCn1cc(C2CCN(CCOc3ccc(cc3C(O)=O)C(C)=O)CC2)c2ccccc12
Show InChI InChI=1S/C28H34N2O5/c1-3-34-16-15-30-19-25(23-6-4-5-7-26(23)30)21-10-12-29(13-11-21)14-17-35-27-9-8-22(20(2)31)18-24(27)28(32)33/h4-9,18-19,21H,3,10-17H2,1-2H3,(H,32,33)
n/an/a 219n/an/an/an/an/an/a
Rhône-Poulenc Rorer
Curated by ChEMBL
Assay Description
Displacement of [3H]mepyramine from histamine H1 receptor in guinea pig cerebellum membranes
J Med Chem 47: 6326-37 (2004)
Article DOI: 10.1021/jm0498203
BindingDB Entry DOI: 10.7270/Q2HM57XC