null
SMILES: COCCn1cc(C2CCN(Cc3ccc(OC)c(c3)C(O)=O)CC2)c2ccccc12
InChI Key: InChIKey=YNSYFJYJHVDOEP-UHFFFAOYSA-N
Activity Spreadsheet -- Enzyme Inhibition Constant Data from BindingDB
Found 2 hits for monomerid = 50156896
Trg + Lig
Ki
nM
ΔG°
kcal/mole
IC50
nM
Kd
nM
EC50/IC50
nM
koff
s-1
kon
M-1s-1
pHTemp
°C
Histamine H2 receptor
(Homo sapiens (Human))
BDBM50156896
(2-methoxy-5-{4-[1-(2-methoxyethyl)-1H-indol-3-yl]p...)
Show SMILES COCCn1cc(C2CCN(Cc3ccc(OC)c(c3)C(O)=O)CC2)c2ccccc12
Show InChI InChI=1S/C25H30N2O4/c1-30-14-13-27-17-22(20-5-3-4-6-23(20)27)19-9-11-26(12-10-19)16-18-7-8-24(31-2)21(15-18)25(28)29/h3-8,15,17,19H,9-14,16H2,1-2H3,(H,28,29)
Reactome pathway
n/an/a>1.00E+4n/an/an/an/an/an/a
Rhône-Poulenc Rorer
Curated by ChEMBL
Assay Description
Displacement of [3H]ketanserine from histamine H2 receptor in human cortex membranes
J Med Chem 47: 6326-37 (2004)
Article DOI: 10.1021/jm0498203
BindingDB Entry DOI: 10.7270/Q2HM57XC
Histamine H1 receptor
(Cavia porcellus (domestic guinea pig))
BDBM50156896
(2-methoxy-5-{4-[1-(2-methoxyethyl)-1H-indol-3-yl]p...)
Show SMILES COCCn1cc(C2CCN(Cc3ccc(OC)c(c3)C(O)=O)CC2)c2ccccc12
Show InChI InChI=1S/C25H30N2O4/c1-30-14-13-27-17-22(20-5-3-4-6-23(20)27)19-9-11-26(12-10-19)16-18-7-8-24(31-2)21(15-18)25(28)29/h3-8,15,17,19H,9-14,16H2,1-2H3,(H,28,29)
n/an/a 470n/an/an/an/an/an/a
Rhône-Poulenc Rorer
Curated by ChEMBL
Assay Description
Displacement of [3H]mepyramine from histamine H1 receptor in guinea pig cerebellum membranes
J Med Chem 47: 6326-37 (2004)
Article DOI: 10.1021/jm0498203
BindingDB Entry DOI: 10.7270/Q2HM57XC