BDBM50156961 CHEMBL3793112
SMILES: Clc1ccc(CN2CCO[C@H](COc3ccccc3)C2)cc1
InChI Key: InChIKey=ADLDHPQXYLISLU-SFHVURJKSA-N
Data: 1 KI  1 IC50
Activity Spreadsheet -- Enzyme Inhibition Constant Data from BindingDB
Found 2 hits for monomerid = 50156961
Trg + Lig
Ki
nM
ΔG°
kcal/mole
IC50
nM
Kd
nM
EC50/IC50
nM
koff
s-1
kon
M-1s-1
pHTemp
°C
D(4) dopamine receptor
(Homo sapiens (Human))
BDBM50156961
(CHEMBL3793112)
Show SMILES Clc1ccc(CN2CCO[C@H](COc3ccccc3)C2)cc1 |r|
Show InChI InChI=1S/C18H20ClNO2/c19-16-8-6-15(7-9-16)12-20-10-11-21-18(13-20)14-22-17-4-2-1-3-5-17/h1-9,18H,10-14H2/t18-/m0/s1
Reactome pathway
42n/an/an/an/an/an/an/an/a
Vanderbilt University
Curated by ChEMBL
Assay Description
Displacement of [3H]-Spiperone from human recombinant dopamine D4 receptor expressed in CHOK1 cells
Bioorg Med Chem Lett 26: 2481-8 (2016)
BindingDB Entry DOI: 10.7270/Q2G44S5M
D(4) dopamine receptor
(Homo sapiens (Human))
BDBM50156961
(CHEMBL3793112)
Show SMILES Clc1ccc(CN2CCO[C@H](COc3ccccc3)C2)cc1 |r|
Show InChI InChI=1S/C18H20ClNO2/c19-16-8-6-15(7-9-16)12-20-10-11-21-18(13-20)14-22-17-4-2-1-3-5-17/h1-9,18H,10-14H2/t18-/m0/s1
Reactome pathway
n/an/a 150n/an/an/an/an/an/a
Vanderbilt University
Curated by ChEMBL
Assay Description
Displacement of [3H]-Spiperone from human recombinant dopamine D4 receptor expressed in CHOK1 cells
Bioorg Med Chem Lett 26: 2481-8 (2016)
BindingDB Entry DOI: 10.7270/Q2G44S5M