BDBM50157209 (1E)-1-(3,4-dichlorophenyl)-3-phenylpropan-1-one thiosemicarbazone::CHEMBL183005
SMILES: NC(=S)NN=C(CCc1ccccc1)c1ccc(Cl)c(Cl)c1
InChI Key: InChIKey=VXWORSGAIFVSON-UHFFFAOYSA-N
Data: 3 IC50
Activity Spreadsheet -- Enzyme Inhibition Constant Data from BindingDB
Found 3 hits for monomerid = 50157209
Trg + Lig
Ki
nM
ΔG°
kcal/mole
IC50
nM
Kd
nM
EC50/IC50
nM
koff
s-1
kon
M-1s-1
pHTemp
°C
Falcipain-2
(Plasmodium falciparum)
BDBM50157209
((1E)-1-(3,4-dichlorophenyl)-3-phenylpropan-1-one t...)
Show SMILES NC(=S)NN=C(CCc1ccccc1)c1ccc(Cl)c(Cl)c1 |w:4.3|
Show InChI InChI=1S/C16H15Cl2N3S/c17-13-8-7-12(10-14(13)18)15(20-21-16(19)22)9-6-11-4-2-1-3-5-11/h1-5,7-8,10H,6,9H2,(H3,19,21,22)
n/an/a 2.60E+3n/an/an/an/an/an/a
University of California-San Francisco
Curated by ChEMBL
Assay Description
Inhibitory concentration against falcipain-2 of Plasmodium falciparum W2
Bioorg Med Chem Lett 15: 121-3 (2004)
Article DOI: 10.1016/j.bmcl.2004.10.023
BindingDB Entry DOI: 10.7270/Q2BV7G4K
Cruzipain
(Trypanosoma cruzi)
BDBM50157209
((1E)-1-(3,4-dichlorophenyl)-3-phenylpropan-1-one t...)
Show SMILES NC(=S)NN=C(CCc1ccccc1)c1ccc(Cl)c(Cl)c1 |w:4.3|
Show InChI InChI=1S/C16H15Cl2N3S/c17-13-8-7-12(10-14(13)18)15(20-21-16(19)22)9-6-11-4-2-1-3-5-11/h1-5,7-8,10H,6,9H2,(H3,19,21,22)
n/an/a 40n/an/an/an/an/an/a
University of California-San Francisco
Curated by ChEMBL
Assay Description
Inhibitory concentration against cruzain of Trypanosoma cruzi
Bioorg Med Chem Lett 15: 121-3 (2004)
Article DOI: 10.1016/j.bmcl.2004.10.023
BindingDB Entry DOI: 10.7270/Q2BV7G4K
Rhodesain
(Trypanosoma brucei rhodesiense)
BDBM50157209
((1E)-1-(3,4-dichlorophenyl)-3-phenylpropan-1-one t...)
Show SMILES NC(=S)NN=C(CCc1ccccc1)c1ccc(Cl)c(Cl)c1 |w:4.3|
Show InChI InChI=1S/C16H15Cl2N3S/c17-13-8-7-12(10-14(13)18)15(20-21-16(19)22)9-6-11-4-2-1-3-5-11/h1-5,7-8,10H,6,9H2,(H3,19,21,22)
n/an/a 90n/an/an/an/an/an/a
University of California-San Francisco
Curated by ChEMBL
Assay Description
Inhibitory concentration against rhodesain of Trypanosoma brucei rhodesience
Bioorg Med Chem Lett 15: 121-3 (2004)
Article DOI: 10.1016/j.bmcl.2004.10.023
BindingDB Entry DOI: 10.7270/Q2BV7G4K