null
SMILES: Oc1ccc(cc1)-c1nn(C2CCCC2)c2c(F)cccc12
InChI Key: InChIKey=IYPUUNMLLKLEOH-UHFFFAOYSA-N
Activity Spreadsheet -- Enzyme Inhibition Constant Data from BindingDB
Found 2 hits for monomerid = 50157483
Trg + Lig
Ki
nM
ΔG°
kcal/mole
IC50
nM
Kd
nM
EC50/IC50
nM
koff
s-1
kon
M-1s-1
pHTemp
°C
Estrogen receptor
(Homo sapiens (Human))
BDBM50157483
(4-(1-cyclopentyl-7-fluoro-1H-indazol-3-yl)phenol |...)
Show SMILES Oc1ccc(cc1)-c1nn(C2CCCC2)c2c(F)cccc12
Show InChI InChI=1S/C18H17FN2O/c19-16-7-3-6-15-17(12-8-10-14(22)11-9-12)20-21(18(15)16)13-4-1-2-5-13/h3,6-11,13,22H,1-2,4-5H2
n/an/an/an/a 330n/an/an/an/a
Wyeth Research
Curated by ChEMBL
Assay Description
Activity at human ERalpha expressed in HAECT1 cells assessed as stimulation of creatine kinase activity
J Med Chem 47: 6435-8 (2004)
Article DOI: 10.1021/jm049194+
BindingDB Entry DOI: 10.7270/Q2639P7B
Estrogen receptor
(Homo sapiens (Human))
BDBM50157483
(4-(1-cyclopentyl-7-fluoro-1H-indazol-3-yl)phenol |...)
Show SMILES Oc1ccc(cc1)-c1nn(C2CCCC2)c2c(F)cccc12
Show InChI InChI=1S/C18H17FN2O/c19-16-7-3-6-15-17(12-8-10-14(22)11-9-12)20-21(18(15)16)13-4-1-2-5-13/h3,6-11,13,22H,1-2,4-5H2
n/an/a 18n/an/an/an/an/an/a
Wyeth Research
Curated by ChEMBL
Assay Description
Activity at human ERalpha expressed in HAECT1 cells assessed as inhibition of NFkappaB transcription
J Med Chem 47: 6435-8 (2004)
Article DOI: 10.1021/jm049194+
BindingDB Entry DOI: 10.7270/Q2639P7B