BDBM50157547 2-(3,4-dihydroxyphenyl)-7,8-dihydroxy-4H-chromen-4-one::7,8,3',4'-tetrahydroxyflavone::CHEMBL222541
SMILES: Oc1ccc(cc1O)-c1cc(=O)c2ccc(O)c(O)c2o1
InChI Key: InChIKey=ARYCMKPCDNHQCL-UHFFFAOYSA-N
Data: 7 IC50
PDB links: 2 PDB IDs match this monomer.
Activity Spreadsheet -- Enzyme Inhibition Constant Data from BindingDB
Found 7 hits for monomerid = 50157547
Trg + Lig
Ki
nM
ΔG°
kcal/mole
IC50
nM
Kd
nM
EC50/IC50
nM
koff
s-1
kon
M-1s-1
pHTemp
°C
Telomerase reverse transcriptase
(Homo sapiens (Human))
BDBM50157547
(2-(3,4-dihydroxyphenyl)-7,8-dihydroxy-4H-chromen-4...)
Show SMILES Oc1ccc(cc1O)-c1cc(=O)c2ccc(O)c(O)c2o1
Show InChI InChI=1S/C15H10O6/c16-9-3-1-7(5-12(9)19)13-6-11(18)8-2-4-10(17)14(20)15(8)21-13/h1-6,16-17,19-20H
NCI pathway
Reactome pathway
n/an/a 200n/an/an/an/an/an/a
BU-Nerviano Medical Sciences
Curated by ChEMBL
Assay Description
Inhibition of human telomerase from HEK293 cell extracts by Flash-Plate assay
J Med Chem 47: 6466-75 (2004)
Article DOI: 10.1021/jm040810b
BindingDB Entry DOI: 10.7270/Q2P55N1R
Cyclin-dependent kinase 2
(Homo sapiens (Human))
BDBM50157547
(2-(3,4-dihydroxyphenyl)-7,8-dihydroxy-4H-chromen-4...)
Show SMILES Oc1ccc(cc1O)-c1cc(=O)c2ccc(O)c(O)c2o1
Show InChI InChI=1S/C15H10O6/c16-9-3-1-7(5-12(9)19)13-6-11(18)8-2-4-10(17)14(20)15(8)21-13/h1-6,16-17,19-20H
NCI pathway
Reactome pathway
n/an/a>5.00E+5n/an/an/an/an/an/a
Keimyung University
Curated by ChEMBL
Assay Description
Inhibition of CDK2
Bioorg Med Chem Lett 17: 1284-7 (2007)
Article DOI: 10.1016/j.bmcl.2006.12.011
BindingDB Entry DOI: 10.7270/Q2BK1C0H
Polyphenol oxidase 2
(Agaricus bisporus (Common mushroom))
BDBM50157547
(2-(3,4-dihydroxyphenyl)-7,8-dihydroxy-4H-chromen-4...)
Show SMILES Oc1ccc(cc1O)-c1cc(=O)c2ccc(O)c(O)c2o1
Show InChI InChI=1S/C15H10O6/c16-9-3-1-7(5-12(9)19)13-6-11(18)8-2-4-10(17)14(20)15(8)21-13/h1-6,16-17,19-20H
n/an/a 70n/an/an/an/an/an/a
Institute for Theoretical Medicine, Inc.
Curated by ChEMBL
Assay Description
Non-competitive inhibition of mushroom tyrosinase
Bioorg Med Chem 22: 6193-200 (2014)
Article DOI: 10.1016/j.bmc.2014.08.027
BindingDB Entry DOI: 10.7270/Q2DV1MG2
Telomerase reverse transcriptase
(Homo sapiens (Human))
BDBM50157547
(2-(3,4-dihydroxyphenyl)-7,8-dihydroxy-4H-chromen-4...)
Show SMILES Oc1ccc(cc1O)-c1cc(=O)c2ccc(O)c(O)c2o1
Show InChI InChI=1S/C15H10O6/c16-9-3-1-7(5-12(9)19)13-6-11(18)8-2-4-10(17)14(20)15(8)21-13/h1-6,16-17,19-20H
NCI pathway
Reactome pathway
n/an/a 740n/an/an/an/an/an/a
University of Oxford
Curated by ChEMBL
Assay Description
Inhibition of telomerase activity (unknown origin) in cell free system using sulforhodamine labeled primer measured after 30 mins by telomerase repea...
Eur J Med Chem 125: 117-129 (2017)
BindingDB Entry DOI: 10.7270/Q2NS0X5V
Telomerase reverse transcriptase
(Homo sapiens (Human))
BDBM50157547
(2-(3,4-dihydroxyphenyl)-7,8-dihydroxy-4H-chromen-4...)
Show SMILES Oc1ccc(cc1O)-c1cc(=O)c2ccc(O)c(O)c2o1
Show InChI InChI=1S/C15H10O6/c16-9-3-1-7(5-12(9)19)13-6-11(18)8-2-4-10(17)14(20)15(8)21-13/h1-6,16-17,19-20H
NCI pathway
Reactome pathway
n/an/a 250n/an/an/an/an/an/a
University of California
Curated by ChEMBL
Assay Description
Inhibition of telomerase in human HeLa cells using 5'-AAT CCG TCG AGC AGA GTT-3' as substrate incubated for 15 mins prior to extension reaction follo...
J Med Chem 55: 3678-86 (2012)
Article DOI: 10.1021/jm201191d
BindingDB Entry DOI: 10.7270/Q2DF6SB3
Telomerase reverse transcriptase
(Homo sapiens (Human))
BDBM50157547
(2-(3,4-dihydroxyphenyl)-7,8-dihydroxy-4H-chromen-4...)
Show SMILES Oc1ccc(cc1O)-c1cc(=O)c2ccc(O)c(O)c2o1
Show InChI InChI=1S/C15H10O6/c16-9-3-1-7(5-12(9)19)13-6-11(18)8-2-4-10(17)14(20)15(8)21-13/h1-6,16-17,19-20H
NCI pathway
Reactome pathway
n/an/a 230n/an/an/an/an/an/a
University of California
Curated by ChEMBL
Assay Description
Inhibition of telomerase in human HeLa cells using 5'-AAT CCG TCG AGC AGA GTT-3' as substrate incubated for 15 mins prior to extension reaction by te...
J Med Chem 55: 3678-86 (2012)
Article DOI: 10.1021/jm201191d
BindingDB Entry DOI: 10.7270/Q2DF6SB3
Telomerase reverse transcriptase
(Homo sapiens (Human))
BDBM50157547
(2-(3,4-dihydroxyphenyl)-7,8-dihydroxy-4H-chromen-4...)
Show SMILES Oc1ccc(cc1O)-c1cc(=O)c2ccc(O)c(O)c2o1
Show InChI InChI=1S/C15H10O6/c16-9-3-1-7(5-12(9)19)13-6-11(18)8-2-4-10(17)14(20)15(8)21-13/h1-6,16-17,19-20H
NCI pathway
Reactome pathway
n/an/a 200n/an/an/an/an/an/a
University of California
Curated by ChEMBL
Assay Description
Inhibition of telomerase in human HEK293 cells by flashplate assay
J Med Chem 55: 3678-86 (2012)
Article DOI: 10.1021/jm201191d
BindingDB Entry DOI: 10.7270/Q2DF6SB3