null
SMILES: COC(=O)[C@H](NC(=O)[C@@H](CC(C)C)NC(=O)N(C[C@@H](O)[C@@H](Cc1ccccc1)NC(=O)OC(C)(C)C)Cc1ccccc1)C(C)C
InChI Key: InChIKey=DINAVFJXFRFCRE-SKKKGAJSSA-N
Activity Spreadsheet -- Enzyme Inhibition Constant Data from BindingDB
Found 4 hits for monomerid = 50157572
Trg + Lig
Ki
nM
ΔG°
kcal/mole
IC50
nM
Kd
nM
EC50/IC50
nM
koff
s-1
kon
M-1s-1
pHTemp
°C
Gamma-secretase subunit APH-1A/Gamma-secretase subunit APH-1B/Gamma-secretase subunit PEN-2/Nicastrin/Presenilin-1/Presenilin-2
(Homo sapiens (Human))
BDBM50157572
((R)-methyl 2-((R)-2-(3-benzyl-3-((2R,3R)-3-(tert-b...)
Show SMILES COC(=O)[C@H](NC(=O)[C@@H](CC(C)C)NC(=O)N(C[C@@H](O)[C@@H](Cc1ccccc1)NC(=O)OC(C)(C)C)Cc1ccccc1)C(C)C |r|
Show InChI InChI=1S/C35H52N4O7/c1-23(2)19-28(31(41)38-30(24(3)4)32(42)45-8)36-33(43)39(21-26-17-13-10-14-18-26)22-29(40)27(20-25-15-11-9-12-16-25)37-34(44)46-35(5,6)7/h9-18,23-24,27-30,40H,19-22H2,1-8H3,(H,36,43)(H,37,44)(H,38,41)/t27-,28-,29-,30-/m1/s1
n/an/a 100n/an/an/an/an/an/a
Harvard Medical School
Curated by ChEMBL
Assay Description
Inhibition of gamma secretase isolated from HeLa cells by ELISA
J Med Chem 47: 6485-9 (2004)
Article DOI: 10.1021/jm049566e
BindingDB Entry DOI: 10.7270/Q2MK6DP8
Gamma-secretase subunit APH-1A/Gamma-secretase subunit APH-1B/Gamma-secretase subunit PEN-2/Nicastrin/Presenilin-1/Presenilin-2
(Homo sapiens (Human))
BDBM50157572
((R)-methyl 2-((R)-2-(3-benzyl-3-((2R,3R)-3-(tert-b...)
Show SMILES COC(=O)[C@H](NC(=O)[C@@H](CC(C)C)NC(=O)N(C[C@@H](O)[C@@H](Cc1ccccc1)NC(=O)OC(C)(C)C)Cc1ccccc1)C(C)C |r|
Show InChI InChI=1S/C35H52N4O7/c1-23(2)19-28(31(41)38-30(24(3)4)32(42)45-8)36-33(43)39(21-26-17-13-10-14-18-26)22-29(40)27(20-25-15-11-9-12-16-25)37-34(44)46-35(5,6)7/h9-18,23-24,27-30,40H,19-22H2,1-8H3,(H,36,43)(H,37,44)(H,38,41)/t27-,28-,29-,30-/m1/s1
n/an/a 2.00E+3n/an/an/an/an/an/a
Harvard Medical School
Curated by ChEMBL
Assay Description
Inhibition of gamma secretase in CHO cells expressing human APP by ELISA
J Med Chem 47: 6485-9 (2004)
Article DOI: 10.1021/jm049566e
BindingDB Entry DOI: 10.7270/Q2MK6DP8
Gamma-secretase subunit APH-1A/Gamma-secretase subunit APH-1B/Gamma-secretase subunit PEN-2/Nicastrin/Presenilin-1/Presenilin-2
(Homo sapiens (Human))
BDBM50157572
((R)-methyl 2-((R)-2-(3-benzyl-3-((2R,3R)-3-(tert-b...)
Show SMILES COC(=O)[C@H](NC(=O)[C@@H](CC(C)C)NC(=O)N(C[C@@H](O)[C@@H](Cc1ccccc1)NC(=O)OC(C)(C)C)Cc1ccccc1)C(C)C |r|
Show InChI InChI=1S/C35H52N4O7/c1-23(2)19-28(31(41)38-30(24(3)4)32(42)45-8)36-33(43)39(21-26-17-13-10-14-18-26)22-29(40)27(20-25-15-11-9-12-16-25)37-34(44)46-35(5,6)7/h9-18,23-24,27-30,40H,19-22H2,1-8H3,(H,36,43)(H,37,44)(H,38,41)/t27-,28-,29-,30-/m1/s1
n/an/a 1.70E+4n/an/an/an/an/an/a
Harvard Medical School
Curated by ChEMBL
Assay Description
Inhibition of gamma secretase in CHO cells expressing human APP after 24 hrs by ELISA
J Med Chem 47: 6485-9 (2004)
Article DOI: 10.1021/jm049566e
BindingDB Entry DOI: 10.7270/Q2MK6DP8
Gamma-secretase subunit APH-1A/Gamma-secretase subunit APH-1B/Gamma-secretase subunit PEN-2/Nicastrin/Presenilin-1/Presenilin-2
(Homo sapiens (Human))
BDBM50157572
((R)-methyl 2-((R)-2-(3-benzyl-3-((2R,3R)-3-(tert-b...)
Show SMILES COC(=O)[C@H](NC(=O)[C@@H](CC(C)C)NC(=O)N(C[C@@H](O)[C@@H](Cc1ccccc1)NC(=O)OC(C)(C)C)Cc1ccccc1)C(C)C |r|
Show InChI InChI=1S/C35H52N4O7/c1-23(2)19-28(31(41)38-30(24(3)4)32(42)45-8)36-33(43)39(21-26-17-13-10-14-18-26)22-29(40)27(20-25-15-11-9-12-16-25)37-34(44)46-35(5,6)7/h9-18,23-24,27-30,40H,19-22H2,1-8H3,(H,36,43)(H,37,44)(H,38,41)/t27-,28-,29-,30-/m1/s1
n/an/a 2.00E+3n/an/an/an/an/an/a
Harvard Medical School
Curated by ChEMBL
Assay Description
Inhibition of gamma secretase in CHO cells expressing human APP after 4 hrs by ELISA
J Med Chem 47: 6485-9 (2004)
Article DOI: 10.1021/jm049566e
BindingDB Entry DOI: 10.7270/Q2MK6DP8