BDBM50157610 CHEMBL3787109
SMILES: C[C@H](c1nnc2c(F)cc(cn12)-c1cnn(C)c1)n1ccc2ncccc2c1=O
InChI Key: InChIKey=SFSZKIHBSGGKAC-GFCCVEGCSA-N
Data: 2 IC50
Activity Spreadsheet -- Enzyme Inhibition Constant Data from BindingDB
Found 2 hits for monomerid = 50157610
Trg + Lig
Ki
nM
ΔG°
kcal/mole
IC50
nM
Kd
nM
EC50/IC50
nM
koff
s-1
kon
M-1s-1
pHTemp
°C
Hepatocyte growth factor receptor
(Homo sapiens (Human))
BDBM50157610
(CHEMBL3787109)
Show SMILES C[C@H](c1nnc2c(F)cc(cn12)-c1cnn(C)c1)n1ccc2ncccc2c1=O |r|
Show InChI InChI=1S/C20H16FN7O/c1-12(27-7-5-17-15(20(27)29)4-3-6-22-17)18-24-25-19-16(21)8-13(11-28(18)19)14-9-23-26(2)10-14/h3-12H,1-2H3/t12-/m1/s1
n/an/a 8n/an/an/an/an/an/a
Amgen Inc
Curated by ChEMBL
Assay Description
Inhibition of HGF-mediated MET autophosphorylation in human PC3 cells preincubated for 1 hr followed by stimulation with human HGF measured after 10 ...
J Med Chem 59: 2328-42 (2016)
BindingDB Entry DOI: 10.7270/Q2SN0BVN
Hepatocyte growth factor receptor
(Homo sapiens (Human))
BDBM50157610
(CHEMBL3787109)
Show SMILES C[C@H](c1nnc2c(F)cc(cn12)-c1cnn(C)c1)n1ccc2ncccc2c1=O |r|
Show InChI InChI=1S/C20H16FN7O/c1-12(27-7-5-17-15(20(27)29)4-3-6-22-17)18-24-25-19-16(21)8-13(11-28(18)19)14-9-23-26(2)10-14/h3-12H,1-2H3/t12-/m1/s1
n/an/a 2n/an/an/an/an/an/a
Amgen Inc
Curated by ChEMBL
Assay Description
Inhibition of recombinant MET (unknown origin) using gastrin peptide as substrate preincubated for 30 mins followed by substrate addition incubated f...
J Med Chem 59: 2328-42 (2016)
BindingDB Entry DOI: 10.7270/Q2SN0BVN