BDBM50157611 CHEMBL3787627
SMILES: CC1(C)CCC(C)(C)c2cc(ccc12)C1(OCCO1)c1ccc(CCC(O)=O)cc1
InChI Key: InChIKey=LOBZKCODPZKVDD-UHFFFAOYSA-N
Data: 2 IC50
Activity Spreadsheet -- Enzyme Inhibition Constant Data from BindingDB
Found 2 hits for monomerid = 50157611
Trg + Lig
Ki
nM
ΔG°
kcal/mole
IC50
nM
Kd
nM
EC50/IC50
nM
koff
s-1
kon
M-1s-1
pHTemp
°C
Cytochrome CYP26A1
(Homo sapiens (Human))
BDBM50157611
(CHEMBL3787627)
Show SMILES CC1(C)CCC(C)(C)c2cc(ccc12)C1(OCCO1)c1ccc(CCC(O)=O)cc1
Show InChI InChI=1S/C26H32O4/c1-24(2)13-14-25(3,4)22-17-20(10-11-21(22)24)26(29-15-16-30-26)19-8-5-18(6-9-19)7-12-23(27)28/h5-6,8-11,17H,7,12-16H2,1-4H3,(H,27,28)
Reactome pathway
n/an/a 340n/an/an/an/an/an/a
The University of Montana
Curated by ChEMBL
Assay Description
Inhibition of microsomal fraction of human CYP26A1 expressed in Sf9 cells using 9-cis-RA as substrate preincubated for 5 mins followed by NADPH addit...
J Med Chem 59: 2579-95 (2016)
BindingDB Entry DOI: 10.7270/Q2J38VG8
Cytochrome P450 26B1
(Homo sapiens (Human))
BDBM50157611
(CHEMBL3787627)
Show SMILES CC1(C)CCC(C)(C)c2cc(ccc12)C1(OCCO1)c1ccc(CCC(O)=O)cc1
Show InChI InChI=1S/C26H32O4/c1-24(2)13-14-25(3,4)22-17-20(10-11-21(22)24)26(29-15-16-30-26)19-8-5-18(6-9-19)7-12-23(27)28/h5-6,8-11,17H,7,12-16H2,1-4H3,(H,27,28)
n/an/a 1.45E+4n/an/an/an/an/an/a
The University of Montana
Curated by ChEMBL
Assay Description
Inhibition of microsomal fraction of human CYP26B1 expressed in Sf9 cells using 9-cis-RA as substrate preincubated for 5 mins followed by NADPH addit...
J Med Chem 59: 2579-95 (2016)
BindingDB Entry DOI: 10.7270/Q2J38VG8