BDBM50157612 CHEMBL3785909
SMILES: COCCOc1cnc2ccn([C@H](C)c3nnc4c(F)cc(cn34)-c3cnn(C)c3)c(=O)c2c1
InChI Key: InChIKey=DWHXUGDWKAIASB-CQSZACIVSA-N
Data: 2 IC50
PDB links: 1 PDB ID matches this monomer.
Activity Spreadsheet -- Enzyme Inhibition Constant Data from BindingDB
Found 2 hits for monomerid = 50157612
Trg + Lig
Ki
nM
ΔG°
kcal/mole
IC50
nM
Kd
nM
EC50/IC50
nM
koff
s-1
kon
M-1s-1
pHTemp
°C
Hepatocyte growth factor receptor
(Homo sapiens (Human))
BDBM50157612
(CHEMBL3785909)
Show SMILES COCCOc1cnc2ccn([C@H](C)c3nnc4c(F)cc(cn34)-c3cnn(C)c3)c(=O)c2c1 |r|
Show InChI InChI=1S/C23H22FN7O3/c1-14(30-5-4-20-18(23(30)32)9-17(11-25-20)34-7-6-33-3)21-27-28-22-19(24)8-15(13-31(21)22)16-10-26-29(2)12-16/h4-5,8-14H,6-7H2,1-3H3/t14-/m1/s1
n/an/a 5n/an/an/an/an/an/a
Amgen Inc
Curated by ChEMBL
Assay Description
Inhibition of HGF-mediated MET autophosphorylation in human PC3 cells preincubated for 1 hr followed by stimulation with human HGF measured after 10 ...
J Med Chem 59: 2328-42 (2016)
BindingDB Entry DOI: 10.7270/Q2SN0BVN
3D
3D Structure (crystal)
Hepatocyte growth factor receptor
(Homo sapiens (Human))
BDBM50157612
(CHEMBL3785909)
Show SMILES COCCOc1cnc2ccn([C@H](C)c3nnc4c(F)cc(cn34)-c3cnn(C)c3)c(=O)c2c1 |r|
Show InChI InChI=1S/C23H22FN7O3/c1-14(30-5-4-20-18(23(30)32)9-17(11-25-20)34-7-6-33-3)21-27-28-22-19(24)8-15(13-31(21)22)16-10-26-29(2)12-16/h4-5,8-14H,6-7H2,1-3H3/t14-/m1/s1
n/an/a 1n/an/an/an/an/an/a
Amgen Inc
Curated by ChEMBL
Assay Description
Inhibition of recombinant MET (unknown origin) using gastrin peptide as substrate preincubated for 30 mins followed by substrate addition incubated f...
J Med Chem 59: 2328-42 (2016)
BindingDB Entry DOI: 10.7270/Q2SN0BVN
3D
3D Structure (crystal)