BDBM50157843 7-Benzenesulfonyl-3-hydroxy-1H-thieno[3,2-d]pyrimidine-2,4-dione::CHEMBL361962
SMILES: On1c(=O)[nH]c2c(csc2c1=O)S(=O)(=O)c1ccccc1
InChI Key: InChIKey=JBDRLOXEKRVFOS-UHFFFAOYSA-N
Data: 2 IC50
Activity Spreadsheet -- Enzyme Inhibition Constant Data from BindingDB
Found 2 hits for monomerid = 50157843
Trg + Lig
Ki
nM
ΔG°
kcal/mole
IC50
nM
Kd
nM
EC50/IC50
nM
koff
s-1
kon
M-1s-1
pHTemp
°C
DNA excision repair protein ERCC-5
(Homo sapiens (Human))
BDBM50157843
(7-Benzenesulfonyl-3-hydroxy-1H-thieno[3,2-d]pyrimi...)
Show SMILES On1c(=O)[nH]c2c(csc2c1=O)S(=O)(=O)c1ccccc1
Show InChI InChI=1S/C12H8N2O5S2/c15-11-10-9(13-12(16)14(11)17)8(6-20-10)21(18,19)7-4-2-1-3-5-7/h1-6,17H,(H,13,16)
Reactome pathway
n/an/a 0.0230n/an/an/an/an/an/a
Athersys, Inc.
Curated by ChEMBL
Assay Description
Inhibitory concentration against the xeroderma pigmentosum G
Bioorg Med Chem Lett 15: 277-81 (2004)
Article DOI: 10.1016/j.bmcl.2004.10.086
BindingDB Entry DOI: 10.7270/Q2HD7V46
Flap endonuclease 1
(Homo sapiens (Human))
BDBM50157843
(7-Benzenesulfonyl-3-hydroxy-1H-thieno[3,2-d]pyrimi...)
Show SMILES On1c(=O)[nH]c2c(csc2c1=O)S(=O)(=O)c1ccccc1
Show InChI InChI=1S/C12H8N2O5S2/c15-11-10-9(13-12(16)14(11)17)8(6-20-10)21(18,19)7-4-2-1-3-5-7/h1-6,17H,(H,13,16)
Reactome pathway
n/an/a 0.0100n/an/an/an/an/an/a
Athersys, Inc.
Curated by ChEMBL
Assay Description
Inhibitory concentration against the Flap endonuclease-1
Bioorg Med Chem Lett 15: 277-81 (2004)
Article DOI: 10.1016/j.bmcl.2004.10.086
BindingDB Entry DOI: 10.7270/Q2HD7V46