BDBM50157943 CHEMBL3780763
SMILES: [H][C@@]12CCCC[C@@]1(c1cc3c(cc1O2)C(C)(C)CCC3(C)C)c1ccc(cc1)C(O)=O
InChI Key: InChIKey=GNYIFRIYMYLWAP-KCWPFWIISA-N
Data: 2 EC50
Activity Spreadsheet -- Enzyme Inhibition Constant Data from BindingDB
Found 2 hits for monomerid = 50157943
Trg + Lig
Ki
nM
ΔG°
kcal/mole
IC50
nM
Kd
nM
EC50/IC50
nM
koff
s-1
kon
M-1s-1
pHTemp
°C
Retinoic acid receptor RXR-alpha
(Homo sapiens (Human))
BDBM50157943
(CHEMBL3780763)
Show SMILES [H][C@@]12CCCC[C@@]1(c1cc3c(cc1O2)C(C)(C)CCC3(C)C)c1ccc(cc1)C(O)=O |r|
Show InChI InChI=1S/C27H32O3/c1-25(2)13-14-26(3,4)20-16-22-21(15-19(20)25)27(12-6-5-7-23(27)30-22)18-10-8-17(9-11-18)24(28)29/h8-11,15-16,23H,5-7,12-14H2,1-4H3,(H,28,29)/t23-,27+/m1/s1
NCI pathway
Reactome pathway
n/an/an/an/a 20n/an/an/an/a
University of Gothenburg
Curated by ChEMBL
Assay Description
Agonist activity at histidine-tagged ligand binding domain of human RXRalpha expressed in Escherichia coli BL21 (DE3) by luciferase reporter gene ass...
J Med Chem 59: 1232-8 (2016)
BindingDB Entry DOI: 10.7270/Q2X63PT7
Retinoic acid receptor RXR-alpha
(Homo sapiens (Human))
BDBM50157943
(CHEMBL3780763)
Show SMILES [H][C@@]12CCCC[C@@]1(c1cc3c(cc1O2)C(C)(C)CCC3(C)C)c1ccc(cc1)C(O)=O |r|
Show InChI InChI=1S/C27H32O3/c1-25(2)13-14-26(3,4)20-16-22-21(15-19(20)25)27(12-6-5-7-23(27)30-22)18-10-8-17(9-11-18)24(28)29/h8-11,15-16,23H,5-7,12-14H2,1-4H3,(H,28,29)/t23-,27+/m1/s1
NCI pathway
Reactome pathway
n/an/an/an/a 16n/an/an/an/a
University of Gothenburg
Curated by ChEMBL
Assay Description
Agonist activity at Renilla luciferase/GFP2-tagged RXRalpha homodimer (unknown origin) expressed in HEK293T cells by BRET2 assay
J Med Chem 59: 1232-8 (2016)
BindingDB Entry DOI: 10.7270/Q2X63PT7