null
SMILES: Clc1ccc(s1)S(=O)(=O)NC1C2CCC1Cc1cc(OCCN3CCCCC3)ccc1C2
InChI Key: InChIKey=SHGFOKQUEANRHO-UHFFFAOYSA-N
Activity Spreadsheet -- Enzyme Inhibition Constant Data from BindingDB
Found 1 hit for monomerid = 50158003
Trg + Lig
Ki
nM
ΔG°
kcal/mole
IC50
nM
Kd
nM
EC50/IC50
nM
koff
s-1
kon
M-1s-1
pHTemp
°C
Gamma-secretase subunit APH-1A/Gamma-secretase subunit APH-1B/Gamma-secretase subunit PEN-2/Nicastrin/Presenilin-1/Presenilin-2
(Homo sapiens (Human))
BDBM50158003
(5-Chloro-thiophene-2-sulfonic acid [5-(2-piperidin...)
Show SMILES Clc1ccc(s1)S(=O)(=O)NC1C2CCC1Cc1cc(OCCN3CCCCC3)ccc1C2 |THB:17:16:10:13.12,9:10:16.30.15.31:13.12,29:30:10:13.12|
Show InChI InChI=1S/C24H31ClN2O3S2/c25-22-8-9-23(31-22)32(28,29)26-24-18-4-5-19(24)15-20-16-21(7-6-17(20)14-18)30-13-12-27-10-2-1-3-11-27/h6-9,16,18-19,24,26H,1-5,10-15H2
n/an/a 73n/an/an/an/an/an/a
Merck Sharp & Dohme Research Laboratories
Curated by ChEMBL
Assay Description
Inhibitory concentration against Gamma-secretase in whole cell inhibition assay using SH-SY5Y cells
Bioorg Med Chem Lett 15: 373-8 (2004)
Article DOI: 10.1016/j.bmcl.2004.10.062
BindingDB Entry DOI: 10.7270/Q2445KZQ