BDBM50158022 1-(4-Fluoro-benzenesulfonyl)-3-(1-methyl-1,2,3,6-tetrahydro-pyridin-4-yl)-1H-indole::CHEMBL180765
SMILES: CN1CCC(=CC1)c1cn(c2ccccc12)S(=O)(=O)c1ccc(F)cc1
InChI Key: InChIKey=MGOGWDKJDBVEDO-UHFFFAOYSA-N
Data: 1 KI  1 IC50
Activity Spreadsheet -- Enzyme Inhibition Constant Data from BindingDB
Found 2 hits for monomerid = 50158022
Trg + Lig
Ki
nM
ΔG°
kcal/mole
IC50
nM
Kd
nM
EC50/IC50
nM
koff
s-1
kon
M-1s-1
pHTemp
°C
5-hydroxytryptamine receptor 6
(Homo sapiens (Human))
BDBM50158022
(1-(4-Fluoro-benzenesulfonyl)-3-(1-methyl-1,2,3,6-t...)
Show SMILES CN1CCC(=CC1)c1cn(c2ccccc12)S(=O)(=O)c1ccc(F)cc1 |c:4|
Show InChI InChI=1S/C20H19FN2O2S/c1-22-12-10-15(11-13-22)19-14-23(20-5-3-2-4-18(19)20)26(24,25)17-8-6-16(21)7-9-17/h2-10,14H,11-13H2,1H3
Reactome pathway
5n/an/an/an/an/an/an/an/a
Wyeth Research
Curated by ChEMBL
Assay Description
Binding affinity against cloned human 5-hydroxytryptamine 6 receptor expressed in HeLa cells using [3H]-LSD
Bioorg Med Chem Lett 15: 379-83 (2004)
Article DOI: 10.1016/j.bmcl.2004.10.064
BindingDB Entry DOI: 10.7270/Q20G3JNQ
5-hydroxytryptamine receptor 6
(Homo sapiens (Human))
BDBM50158022
(1-(4-Fluoro-benzenesulfonyl)-3-(1-methyl-1,2,3,6-t...)
Show SMILES CN1CCC(=CC1)c1cn(c2ccccc12)S(=O)(=O)c1ccc(F)cc1 |c:4|
Show InChI InChI=1S/C20H19FN2O2S/c1-22-12-10-15(11-13-22)19-14-23(20-5-3-2-4-18(19)20)26(24,25)17-8-6-16(21)7-9-17/h2-10,14H,11-13H2,1H3
Reactome pathway
n/an/a 42.7n/an/an/an/an/an/a
Wyeth Research
Curated by ChEMBL
Assay Description
Inhibitory concentration against 5-HT stimulated cAMP production in HeLa cells stably transfected with human 5-HT6 receptor
Bioorg Med Chem Lett 15: 379-83 (2004)
Article DOI: 10.1016/j.bmcl.2004.10.064
BindingDB Entry DOI: 10.7270/Q20G3JNQ