BDBM50158024 5-Fluoro-1-(4-fluoro-benzenesulfonyl)-3-(1,2,3,6-tetrahydro-pyridin-4-yl)-1H-indole::CHEMBL361572
SMILES: Fc1ccc(cc1)S(=O)(=O)n1cc(C2=CCNCC2)c2cc(F)ccc12
InChI Key: InChIKey=VZKZWLBHHVMCSG-UHFFFAOYSA-N
Data: 1 KI  1 IC50
Activity Spreadsheet -- Enzyme Inhibition Constant Data from BindingDB
Found 2 hits for monomerid = 50158024
Trg + Lig
Ki
nM
ΔG°
kcal/mole
IC50
nM
Kd
nM
EC50/IC50
nM
koff
s-1
kon
M-1s-1
pHTemp
°C
5-hydroxytryptamine receptor 6
(Homo sapiens (Human))
BDBM50158024
(5-Fluoro-1-(4-fluoro-benzenesulfonyl)-3-(1,2,3,6-t...)
Show SMILES Fc1ccc(cc1)S(=O)(=O)n1cc(C2=CCNCC2)c2cc(F)ccc12 |t:14|
Show InChI InChI=1S/C19H16F2N2O2S/c20-14-1-4-16(5-2-14)26(24,25)23-12-18(13-7-9-22-10-8-13)17-11-15(21)3-6-19(17)23/h1-7,11-12,22H,8-10H2
Reactome pathway
3n/an/an/an/an/an/an/an/a
Wyeth Research
Curated by ChEMBL
Assay Description
Binding affinity against cloned human 5-hydroxytryptamine 6 receptor expressed in HeLa cells using [3H]-LSD
Bioorg Med Chem Lett 15: 379-83 (2004)
Article DOI: 10.1016/j.bmcl.2004.10.064
BindingDB Entry DOI: 10.7270/Q20G3JNQ
5-hydroxytryptamine receptor 6
(Homo sapiens (Human))
BDBM50158024
(5-Fluoro-1-(4-fluoro-benzenesulfonyl)-3-(1,2,3,6-t...)
Show SMILES Fc1ccc(cc1)S(=O)(=O)n1cc(C2=CCNCC2)c2cc(F)ccc12 |t:14|
Show InChI InChI=1S/C19H16F2N2O2S/c20-14-1-4-16(5-2-14)26(24,25)23-12-18(13-7-9-22-10-8-13)17-11-15(21)3-6-19(17)23/h1-7,11-12,22H,8-10H2
Reactome pathway
n/an/a 31n/an/an/an/an/an/a
Wyeth Research
Curated by ChEMBL
Assay Description
Inhibitory concentration against 5-HT stimulated cAMP production in HeLa cells stably transfected with human 5-HT6 receptor
Bioorg Med Chem Lett 15: 379-83 (2004)
Article DOI: 10.1016/j.bmcl.2004.10.064
BindingDB Entry DOI: 10.7270/Q20G3JNQ