BDBM50158242 5-Chloro-1H-indole-2-carboxylic acid {[cyclopentyl-(3-methoxy-propyl)-carbamoyl]-methyl}-amide::CHEMBL181723
SMILES: COCCCN(C1CCCC1)C(=O)CNC(=O)c1cc2cc(Cl)ccc2[nH]1
InChI Key: InChIKey=UXTZBPROLBKFSY-UHFFFAOYSA-N
Data: 1 IC50
Activity Spreadsheet -- Enzyme Inhibition Constant Data from BindingDB
Found 1 hit for monomerid = 50158242
Trg + Lig
Ki
nM
ΔG°
kcal/mole
IC50
nM
Kd
nM
EC50/IC50
nM
koff
s-1
kon
M-1s-1
pHTemp
°C
Glycogen Phosphorylase (PYGL)
(Homo sapiens (Human))
BDBM50158242
(5-Chloro-1H-indole-2-carboxylic acid {[cyclopentyl...)
Show SMILES COCCCN(C1CCCC1)C(=O)CNC(=O)c1cc2cc(Cl)ccc2[nH]1
Show InChI InChI=1S/C20H26ClN3O3/c1-27-10-4-9-24(16-5-2-3-6-16)19(25)13-22-20(26)18-12-14-11-15(21)7-8-17(14)23-18/h7-8,11-12,16,23H,2-6,9-10,13H2,1H3,(H,22,26)
Reactome pathway
n/an/a 370n/an/an/an/an/an/a
Pfizer Global Research and Development
Curated by ChEMBL
Assay Description
Inhibitory concentration against glycogen phosphorylase
Bioorg Med Chem Lett 15: 459-65 (2004)
Article DOI: 10.1016/j.bmcl.2004.10.048
BindingDB Entry DOI: 10.7270/Q26W99K6