BDBM50158246 5-Chloro-1H-indole-2-carboxylic acid ({cyclopentyl-[2-(2-hydroxy-ethoxy)-ethyl]-carbamoyl}-methyl)-amide::CHEMBL178497
SMILES: OCCOCCN(C1CCCC1)C(=O)CNC(=O)c1cc2cc(Cl)ccc2[nH]1
InChI Key: InChIKey=CJJLACJOOLRGRC-UHFFFAOYSA-N
Data: 1 IC50
Activity Spreadsheet -- Enzyme Inhibition Constant Data from BindingDB
Found 1 hit for monomerid = 50158246
Trg + Lig
Ki
nM
ΔG°
kcal/mole
IC50
nM
Kd
nM
EC50/IC50
nM
koff
s-1
kon
M-1s-1
pHTemp
°C
Glycogen Phosphorylase (PYGL)
(Homo sapiens (Human))
BDBM50158246
(5-Chloro-1H-indole-2-carboxylic acid ({cyclopentyl...)
Show SMILES OCCOCCN(C1CCCC1)C(=O)CNC(=O)c1cc2cc(Cl)ccc2[nH]1
Show InChI InChI=1S/C20H26ClN3O4/c21-15-5-6-17-14(11-15)12-18(23-17)20(27)22-13-19(26)24(7-9-28-10-8-25)16-3-1-2-4-16/h5-6,11-12,16,23,25H,1-4,7-10,13H2,(H,22,27)
Reactome pathway
n/an/a 230n/an/an/an/an/an/a
Pfizer Global Research and Development
Curated by ChEMBL
Assay Description
Inhibitory concentration against glycogen phosphorylase
Bioorg Med Chem Lett 15: 459-65 (2004)
Article DOI: 10.1016/j.bmcl.2004.10.048
BindingDB Entry DOI: 10.7270/Q26W99K6