BDBM50158262 5-Chloro-1H-indole-2-carboxylic acid {[(2-hydroxy-ethyl)-isopropyl-carbamoyl]-methyl}-amide::CHEMBL360236
SMILES: CC(C)N(CCO)C(=O)CNC(=O)c1cc2cc(Cl)ccc2[nH]1
InChI Key: InChIKey=LJZUKMRCWDCHNC-UHFFFAOYSA-N
Data: 1 IC50
Activity Spreadsheet -- Enzyme Inhibition Constant Data from BindingDB
Found 1 hit for monomerid = 50158262
Trg + Lig
Ki
nM
ΔG°
kcal/mole
IC50
nM
Kd
nM
EC50/IC50
nM
koff
s-1
kon
M-1s-1
pHTemp
°C
Glycogen Phosphorylase (PYGL)
(Homo sapiens (Human))
BDBM50158262
(5-Chloro-1H-indole-2-carboxylic acid {[(2-hydroxy-...)
Show SMILES CC(C)N(CCO)C(=O)CNC(=O)c1cc2cc(Cl)ccc2[nH]1
Show InChI InChI=1S/C16H20ClN3O3/c1-10(2)20(5-6-21)15(22)9-18-16(23)14-8-11-7-12(17)3-4-13(11)19-14/h3-4,7-8,10,19,21H,5-6,9H2,1-2H3,(H,18,23)
Reactome pathway
n/an/a 210n/an/an/an/an/an/a
Pfizer Global Research and Development
Curated by ChEMBL
Assay Description
Inhibitory concentration against glycogen phosphorylase
Bioorg Med Chem Lett 15: 459-65 (2004)
Article DOI: 10.1016/j.bmcl.2004.10.048
BindingDB Entry DOI: 10.7270/Q26W99K6