BDBM50158370 CHEMBL3780615
SMILES: CNCc1cccc(c1)-c1cccs1
InChI Key: InChIKey=BIULJOFRQMLCQK-UHFFFAOYSA-N
Data: 1 IC50
PDB links: 1 PDB ID matches this monomer.
Activity Spreadsheet -- Enzyme Inhibition Constant Data from BindingDB
Found 1 hit for monomerid = 50158370
Trg + Lig
Ki
nM
ΔG°
kcal/mole
IC50
nM
Kd
nM
EC50/IC50
nM
koff
s-1
kon
M-1s-1
pHTemp
°C
Protein arginine N-methyltransferase 6
(Homo sapiens (Human))
BDBM50158370
(CHEMBL3780615)
Show SMILES CNCc1cccc(c1)-c1cccs1
Show InChI InChI=1S/C12H13NS/c1-13-9-10-4-2-5-11(8-10)12-6-3-7-14-12/h2-8,13H,9H2,1H3
n/an/a 1.25E+5n/an/an/an/an/an/a
University of Toronto
Curated by ChEMBL
Assay Description
Inhibition of N-terminal hexa-His tagged human PRMT6 expressed in Sf9 cells using 24 residues of biotin labelled histone4 substrate and tritiated 3H-...
J Med Chem 59: 1176-83 (2016)
BindingDB Entry DOI: 10.7270/Q2SF2Z11