BDBM50158371 CHEMBL3780738
SMILES: CNCc1cccc(c1)-c1ccsc1
InChI Key: InChIKey=SNXSVYZFYWVLHK-UHFFFAOYSA-N
Data: 1 IC50
Activity Spreadsheet -- Enzyme Inhibition Constant Data from BindingDB
Found 1 hit for monomerid = 50158371
Trg + Lig
Ki
nM
ΔG°
kcal/mole
IC50
nM
Kd
nM
EC50/IC50
nM
koff
s-1
kon
M-1s-1
pHTemp
°C
Protein arginine N-methyltransferase 6
(Homo sapiens (Human))
BDBM50158371
(CHEMBL3780738)
Show SMILES CNCc1cccc(c1)-c1ccsc1
Show InChI InChI=1S/C12H13NS/c1-13-8-10-3-2-4-11(7-10)12-5-6-14-9-12/h2-7,9,13H,8H2,1H3
n/an/a 6.90E+4n/an/an/an/an/an/a
University of Toronto
Curated by ChEMBL
Assay Description
Inhibition of N-terminal hexa-His tagged human PRMT6 expressed in Sf9 cells using 24 residues of biotin labelled histone4 substrate and tritiated 3H-...
J Med Chem 59: 1176-83 (2016)
BindingDB Entry DOI: 10.7270/Q2SF2Z11