BDBM50158465 (4-hydroxy-3,5-diiodophenyl)(2-methylbenzofuran-3-yl)methanone::CHEMBL389052::US9725430, Compound 1d::US9962362, Compound 1d
SMILES: Cc1oc2ccccc2c1C(=O)c1cc(I)c(O)c(I)c1
InChI Key: InChIKey=QLUUKNMPBTWGBB-UHFFFAOYSA-N
Data: 1 KI  2 IC50
Activity Spreadsheet -- Enzyme Inhibition Constant Data from BindingDB
Found 3 hits for monomerid = 50158465
Trg + Lig
Ki
nM
ΔG°
kcal/mole
IC50
nM
Kd
nM
EC50/IC50
nM
koff
s-1
kon
M-1s-1
pHTemp
°C
Cytochrome P450 2C19
(Homo sapiens (Human))
BDBM50158465
((4-hydroxy-3,5-diiodophenyl)(2-methylbenzofuran-3-...)
Show SMILES Cc1oc2ccccc2c1C(=O)c1cc(I)c(O)c(I)c1
Show InChI InChI=1S/C16H10I2O3/c1-8-14(10-4-2-3-5-13(10)21-8)15(19)9-6-11(17)16(20)12(18)7-9/h2-7,20H,1H3
Reactome pathway
7.20E+3n/an/an/an/an/an/an/an/a
Washington State University
Curated by ChEMBL
Assay Description
Inhibition of human CYP2C19
J Med Chem 47: 6768-76 (2004)
Article DOI: 10.1021/jm049605m
BindingDB Entry DOI: 10.7270/Q29P3153
Eyes absent homolog 3 (EYA3)
(Homo sapiens (Human))
BDBM50158465
((4-hydroxy-3,5-diiodophenyl)(2-methylbenzofuran-3-...)
Show SMILES Cc1oc2ccccc2c1C(=O)c1cc(I)c(O)c(I)c1
Show InChI InChI=1S/C16H10I2O3/c1-8-14(10-4-2-3-5-13(10)21-8)15(19)9-6-11(17)16(20)12(18)7-9/h2-7,20H,1H3
US Patent
n/an/a 8.30E+3n/an/an/an/an/an/a
GNF
Assay Description
The compounds were then tested using full-length human recombinant, purified EYA3 and pNPP as a substrate. Compounds were dissolved in DMSO and dilut...
Bioorg Med Chem Lett 16: 5488-92 (2006)
BindingDB Entry DOI: 10.7270/Q2ZK5JZ7
Eyes absent homolog 3 (EYA3)
(Homo sapiens (Human))
BDBM50158465
((4-hydroxy-3,5-diiodophenyl)(2-methylbenzofuran-3-...)
Show SMILES Cc1oc2ccccc2c1C(=O)c1cc(I)c(O)c(I)c1
Show InChI InChI=1S/C16H10I2O3/c1-8-14(10-4-2-3-5-13(10)21-8)15(19)9-6-11(17)16(20)12(18)7-9/h2-7,20H,1H3
US Patent
n/an/a 8.30E+3n/an/an/an/an/an/a
CHILDREN HOSPITAL MEDICAL CENTER
US Patent
Assay Description
An inhibitory assay was conducted using the previously described p-nitrophenylphosphate assay (Rayapureddi, J. P. et al. Nature 426, 295-298 (2003))....
US Patent US9725430 (2017)
BindingDB Entry DOI: 10.7270/Q23F4RSZ