BDBM50158620 CHEMBL3787548
SMILES: OC(=O)c1ccnc2cc(OCc3ccc(Cl)c(OCC4CC4)c3)[nH]c12
InChI Key: InChIKey=RHPSPIUSPOTEGT-UHFFFAOYSA-N
Data: 4 IC50
Activity Spreadsheet -- Enzyme Inhibition Constant Data from BindingDB
Found 4 hits for monomerid = 50158620
Trg + Lig
Ki
nM
ΔG°
kcal/mole
IC50
nM
Kd
nM
EC50/IC50
nM
koff
s-1
kon
M-1s-1
pHTemp
°C
Lysine-specific demethylase 5B
(Homo sapiens (Human))
BDBM50158620
(CHEMBL3787548)
Show SMILES OC(=O)c1ccnc2cc(OCc3ccc(Cl)c(OCC4CC4)c3)[nH]c12
Show InChI InChI=1S/C19H17ClN2O4/c20-14-4-3-12(7-16(14)25-9-11-1-2-11)10-26-17-8-15-18(22-17)13(19(23)24)5-6-21-15/h3-8,11,22H,1-2,9-10H2,(H,23,24)
n/an/a<100n/an/an/an/an/an/a
University of Oxford
Curated by ChEMBL
Assay Description
Inhibition of recombinant human N-terminal His-FLAG-tagged KDM5B (2 to 751 residues) expressed in baculovirus infected sf9 cells using biotin-H3K4me3...
J Med Chem 59: 1308-29 (2016)
BindingDB Entry DOI: 10.7270/Q2MP5559
Lysine-specific demethylase 5A
(Homo sapiens (Human))
BDBM50158620
(CHEMBL3787548)
Show SMILES OC(=O)c1ccnc2cc(OCc3ccc(Cl)c(OCC4CC4)c3)[nH]c12
Show InChI InChI=1S/C19H17ClN2O4/c20-14-4-3-12(7-16(14)25-9-11-1-2-11)10-26-17-8-15-18(22-17)13(19(23)24)5-6-21-15/h3-8,11,22H,1-2,9-10H2,(H,23,24)
Reactome pathway
n/an/a 100n/an/an/an/an/an/a
University of Oxford
Curated by ChEMBL
Assay Description
Inhibition of recombinant human C-terminal FLAG-tagged KDM5A (1 to 1090 residues) expressed in baculovirus infected sf9 cells using biotin-H3K4me3 su...
J Med Chem 59: 1308-29 (2016)
BindingDB Entry DOI: 10.7270/Q2MP5559
Lysine-specific demethylase 4A
(Homo sapiens (Human))
BDBM50158620
(CHEMBL3787548)
Show SMILES OC(=O)c1ccnc2cc(OCc3ccc(Cl)c(OCC4CC4)c3)[nH]c12
Show InChI InChI=1S/C19H17ClN2O4/c20-14-4-3-12(7-16(14)25-9-11-1-2-11)10-26-17-8-15-18(22-17)13(19(23)24)5-6-21-15/h3-8,11,22H,1-2,9-10H2,(H,23,24)
n/an/a 1.00E+3n/an/an/an/an/an/a
University of Oxford
Curated by ChEMBL
Assay Description
Inhibition of recombinant human N-terminal His-tagged KDM4A (1 to 350 residues) expressed in Escherichia coli using biotin-H3K9me3 substrate incubate...
J Med Chem 59: 1308-29 (2016)
BindingDB Entry DOI: 10.7270/Q2MP5559
Lysine-specific demethylase 4C
(Homo sapiens (Human))
BDBM50158620
(CHEMBL3787548)
Show SMILES OC(=O)c1ccnc2cc(OCc3ccc(Cl)c(OCC4CC4)c3)[nH]c12
Show InChI InChI=1S/C19H17ClN2O4/c20-14-4-3-12(7-16(14)25-9-11-1-2-11)10-26-17-8-15-18(22-17)13(19(23)24)5-6-21-15/h3-8,11,22H,1-2,9-10H2,(H,23,24)
n/an/a<100n/an/an/an/an/an/a
University of Oxford
Curated by ChEMBL
Assay Description
Inhibition of recombinant human N-terminal GST-tagged KDM4C (2 to 372 residues) expressed in baculovirus infected sf9 cells using biotin-H3K9me3 subs...
J Med Chem 59: 1308-29 (2016)
BindingDB Entry DOI: 10.7270/Q2MP5559