BDBM50158622 CHEMBL3786682
SMILES: Cn1cc2-c3cc(CS(C)(=O)=O)ccc3N(Cc3c[nH]c(=O)c1c23)c1ccccn1
InChI Key: InChIKey=KODRSHGSDLNFGJ-UHFFFAOYSA-N
Data: 1 IC50
Activity Spreadsheet -- Enzyme Inhibition Constant Data from BindingDB
Found 1 hit for monomerid = 50158622
Trg + Lig
Ki
nM
ΔG°
kcal/mole
IC50
nM
Kd
nM
EC50/IC50
nM
koff
s-1
kon
M-1s-1
pHTemp
°C
Bromodomain-containing protein 4
(Homo sapiens (Human))
BDBM50158622
(CHEMBL3786682)
Show SMILES Cn1cc2-c3cc(CS(C)(=O)=O)ccc3N(Cc3c[nH]c(=O)c1c23)c1ccccn1
Show InChI InChI=1S/C22H20N4O3S/c1-25-12-17-16-9-14(13-30(2,28)29)6-7-18(16)26(19-5-3-4-8-23-19)11-15-10-24-22(27)21(25)20(15)17/h3-10,12H,11,13H2,1-2H3,(H,24,27)
n/an/a 1n/an/an/an/an/an/a
Genentech
Curated by ChEMBL
Assay Description
Binding affinity to His-tagged BRD4 bromodomain1 (unknown origin) (57 to 168 residues) incubated for 1 hr in presence of Europium Cryptate-labeled st...
J Med Chem 59: 1271-98 (2016)
BindingDB Entry DOI: 10.7270/Q2X92D6H