null
SMILES: CSCC[C@H](NC(=O)[C@H](CC(C)C)NC(=O)[C@H](Cc1cnc[nH]1)NC(=O)CNC(=O)[C@@H](NC(=O)[C@H](C)NC(=O)[C@H](Cc1c[nH]c2ccccc12)NC(=O)[C@H](CCC(N)=O)NC(=O)COCC(=O)Nc1ccc(CC(CNCCN)CNCCN)cc1)C(C)C)C(N)=O
InChI Key: InChIKey=IKKYIPCELZIPRY-RNXDXMLZSA-N
Activity Spreadsheet -- Enzyme Inhibition Constant Data from BindingDB
Found 4 hits for monomerid = 50158699
Trg + Lig
Ki
nM
ΔG°
kcal/mole
IC50
nM
Kd
nM
EC50/IC50
nM
koff
s-1
kon
M-1s-1
pHTemp
°C
Neuromedin-B receptor
(Homo sapiens (Human))
BDBM50158699
(CHEMBL414307 | [(N4-Bzdig)0]BB(7-14))
Show SMILES CSCC[C@H](NC(=O)[C@H](CC(C)C)NC(=O)[C@H](Cc1cnc[nH]1)NC(=O)CNC(=O)[C@@H](NC(=O)[C@H](C)NC(=O)[C@H](Cc1c[nH]c2ccccc12)NC(=O)[C@H](CCC(N)=O)NC(=O)COCC(=O)Nc1ccc(CC(CNCCN)CNCCN)cc1)C(C)C)C(N)=O
Show InChI InChI=1S/C61H94N18O12S/c1-35(2)23-47(59(88)76-45(55(65)84)17-22-92-6)77-60(89)49(26-42-30-68-34-71-42)75-51(81)31-70-61(90)54(36(3)4)79-56(85)37(5)72-58(87)48(25-40-29-69-44-10-8-7-9-43(40)44)78-57(86)46(15-16-50(64)80)74-53(83)33-91-32-52(82)73-41-13-11-38(12-14-41)24-39(27-66-20-18-62)28-67-21-19-63/h7-14,29-30,34-37,39,45-49,54,66-67,69H,15-28,31-33,62-63H2,1-6H3,(H2,64,80)(H2,65,84)(H,68,71)(H,70,90)(H,72,87)(H,73,82)(H,74,83)(H,75,81)(H,76,88)(H,77,89)(H,78,86)(H,79,85)/t37-,45-,46-,47-,48-,49-,54-/m0/s1
n/an/a 0.900n/an/an/an/an/an/a
National Center for Scientific Research Demokritos
Curated by ChEMBL
Assay Description
Inhibition of tachykinin receptor 3 expressed in human ileal carcinoid cells
J Med Chem 48: 100-10 (2005)
Article DOI: 10.1021/jm049437y
BindingDB Entry DOI: 10.7270/Q2DF6QQ6
Gastrin-releasing peptide receptor
(Homo sapiens (Human))
BDBM50158699
(CHEMBL414307 | [(N4-Bzdig)0]BB(7-14))
Show SMILES CSCC[C@H](NC(=O)[C@H](CC(C)C)NC(=O)[C@H](Cc1cnc[nH]1)NC(=O)CNC(=O)[C@@H](NC(=O)[C@H](C)NC(=O)[C@H](Cc1c[nH]c2ccccc12)NC(=O)[C@H](CCC(N)=O)NC(=O)COCC(=O)Nc1ccc(CC(CNCCN)CNCCN)cc1)C(C)C)C(N)=O
Show InChI InChI=1S/C61H94N18O12S/c1-35(2)23-47(59(88)76-45(55(65)84)17-22-92-6)77-60(89)49(26-42-30-68-34-71-42)75-51(81)31-70-61(90)54(36(3)4)79-56(85)37(5)72-58(87)48(25-40-29-69-44-10-8-7-9-43(40)44)78-57(86)46(15-16-50(64)80)74-53(83)33-91-32-52(82)73-41-13-11-38(12-14-41)24-39(27-66-20-18-62)28-67-21-19-63/h7-14,29-30,34-37,39,45-49,54,66-67,69H,15-28,31-33,62-63H2,1-6H3,(H2,64,80)(H2,65,84)(H,68,71)(H,70,90)(H,72,87)(H,73,82)(H,74,83)(H,75,81)(H,76,88)(H,77,89)(H,78,86)(H,79,85)/t37-,45-,46-,47-,48-,49-,54-/m0/s1
n/an/a 0.650n/an/an/an/an/an/a
National Center for Scientific Research Demokritos
Curated by ChEMBL
Assay Description
Inhibition of gastrin releasing peptide receptor expressed in human prostate cancer cells
J Med Chem 48: 100-10 (2005)
Article DOI: 10.1021/jm049437y
BindingDB Entry DOI: 10.7270/Q2DF6QQ6
Bombesin receptor subtype-3
(Homo sapiens (Human))
BDBM50158699
(CHEMBL414307 | [(N4-Bzdig)0]BB(7-14))
Show SMILES CSCC[C@H](NC(=O)[C@H](CC(C)C)NC(=O)[C@H](Cc1cnc[nH]1)NC(=O)CNC(=O)[C@@H](NC(=O)[C@H](C)NC(=O)[C@H](Cc1c[nH]c2ccccc12)NC(=O)[C@H](CCC(N)=O)NC(=O)COCC(=O)Nc1ccc(CC(CNCCN)CNCCN)cc1)C(C)C)C(N)=O
Show InChI InChI=1S/C61H94N18O12S/c1-35(2)23-47(59(88)76-45(55(65)84)17-22-92-6)77-60(89)49(26-42-30-68-34-71-42)75-51(81)31-70-61(90)54(36(3)4)79-56(85)37(5)72-58(87)48(25-40-29-69-44-10-8-7-9-43(40)44)78-57(86)46(15-16-50(64)80)74-53(83)33-91-32-52(82)73-41-13-11-38(12-14-41)24-39(27-66-20-18-62)28-67-21-19-63/h7-14,29-30,34-37,39,45-49,54,66-67,69H,15-28,31-33,62-63H2,1-6H3,(H2,64,80)(H2,65,84)(H,68,71)(H,70,90)(H,72,87)(H,73,82)(H,74,83)(H,75,81)(H,76,88)(H,77,89)(H,78,86)(H,79,85)/t37-,45-,46-,47-,48-,49-,54-/m0/s1
Reactome pathway
n/an/a 37n/an/an/an/an/an/a
National Center for Scientific Research Demokritos
Curated by ChEMBL
Assay Description
Inhibition of bombesin subtype 3 receptor expressed in human lung carcinoids
J Med Chem 48: 100-10 (2005)
Article DOI: 10.1021/jm049437y
BindingDB Entry DOI: 10.7270/Q2DF6QQ6
Gastrin-releasing peptide receptor
(Homo sapiens (Human))
BDBM50158699
(CHEMBL414307 | [(N4-Bzdig)0]BB(7-14))
Show SMILES CSCC[C@H](NC(=O)[C@H](CC(C)C)NC(=O)[C@H](Cc1cnc[nH]1)NC(=O)CNC(=O)[C@@H](NC(=O)[C@H](C)NC(=O)[C@H](Cc1c[nH]c2ccccc12)NC(=O)[C@H](CCC(N)=O)NC(=O)COCC(=O)Nc1ccc(CC(CNCCN)CNCCN)cc1)C(C)C)C(N)=O
Show InChI InChI=1S/C61H94N18O12S/c1-35(2)23-47(59(88)76-45(55(65)84)17-22-92-6)77-60(89)49(26-42-30-68-34-71-42)75-51(81)31-70-61(90)54(36(3)4)79-56(85)37(5)72-58(87)48(25-40-29-69-44-10-8-7-9-43(40)44)78-57(86)46(15-16-50(64)80)74-53(83)33-91-32-52(82)73-41-13-11-38(12-14-41)24-39(27-66-20-18-62)28-67-21-19-63/h7-14,29-30,34-37,39,45-49,54,66-67,69H,15-28,31-33,62-63H2,1-6H3,(H2,64,80)(H2,65,84)(H,68,71)(H,70,90)(H,72,87)(H,73,82)(H,74,83)(H,75,81)(H,76,88)(H,77,89)(H,78,86)(H,79,85)/t37-,45-,46-,47-,48-,49-,54-/m0/s1
n/an/a 0.0800n/an/an/an/an/an/a
National Center for Scientific Research Demokritos
Curated by ChEMBL
Assay Description
Displacement of [125 I-Tyr4]BB from human gastrin releasing peptide receptor expressed in PC-3 cell membranes
J Med Chem 48: 100-10 (2005)
Article DOI: 10.1021/jm049437y
BindingDB Entry DOI: 10.7270/Q2DF6QQ6