BDBM50158700 CHEMBL266079::[(N4-Bzdig)0,Nle14]BB(7-14)
SMILES: CCCC[C@H](NC(=O)[C@H](CC(C)C)NC(=O)[C@H](Cc1cnc[nH]1)NC(=O)CNC(=O)[C@@H](NC(=O)[C@H](C)NC(=O)[C@H](Cc1c[nH]c2ccccc12)NC(=O)[C@H](CCC(N)=O)NC(=O)COCC(=O)Nc1ccc(CC(CNCCN)CNCCN)cc1)C(C)C)C(N)=O
InChI Key: InChIKey=XDFRCEDKCPCBTG-KGOWMPLXSA-N
Data: 4 IC50
Activity Spreadsheet -- Enzyme Inhibition Constant Data from BindingDB
Found 4 hits for monomerid = 50158700
Trg + Lig
Ki
nM
ΔG°
kcal/mole
IC50
nM
Kd
nM
EC50/IC50
nM
koff
s-1
kon
M-1s-1
pHTemp
°C
GRPR
(Homo sapiens (Human))
BDBM50158700
(CHEMBL266079 | [(N4-Bzdig)0,Nle14]BB(7-14))
Show SMILES CCCC[C@H](NC(=O)[C@H](CC(C)C)NC(=O)[C@H](Cc1cnc[nH]1)NC(=O)CNC(=O)[C@@H](NC(=O)[C@H](C)NC(=O)[C@H](Cc1c[nH]c2ccccc12)NC(=O)[C@H](CCC(N)=O)NC(=O)COCC(=O)Nc1ccc(CC(CNCCN)CNCCN)cc1)C(C)C)C(N)=O
Show InChI InChI=1S/C62H96N18O12/c1-7-8-12-46(56(66)85)77-60(89)48(24-36(2)3)78-61(90)50(27-43-31-69-35-72-43)76-52(82)32-71-62(91)55(37(4)5)80-57(86)38(6)73-59(88)49(26-41-30-70-45-13-10-9-11-44(41)45)79-58(87)47(18-19-51(65)81)75-54(84)34-92-33-53(83)74-42-16-14-39(15-17-42)25-40(28-67-22-20-63)29-68-23-21-64/h9-11,13-17,30-31,35-38,40,46-50,55,67-68,70H,7-8,12,18-29,32-34,63-64H2,1-6H3,(H2,65,81)(H2,66,85)(H,69,72)(H,71,91)(H,73,88)(H,74,83)(H,75,84)(H,76,82)(H,77,89)(H,78,90)(H,79,87)(H,80,86)/t38-,46-,47-,48-,49-,50-,55-/m0/s1
n/an/a 1.30n/an/an/an/an/an/a
National Center for Scientific Research Demokritos
Curated by ChEMBL
Assay Description
Inhibition of gastrin releasing peptide receptor expressed in human prostate cancer cells
J Med Chem 48: 100-10 (2005)
Article DOI: 10.1021/jm049437y
BindingDB Entry DOI: 10.7270/Q2DF6QQ6
BRS3
(Homo sapiens (Human))
BDBM50158700
(CHEMBL266079 | [(N4-Bzdig)0,Nle14]BB(7-14))
Show SMILES CCCC[C@H](NC(=O)[C@H](CC(C)C)NC(=O)[C@H](Cc1cnc[nH]1)NC(=O)CNC(=O)[C@@H](NC(=O)[C@H](C)NC(=O)[C@H](Cc1c[nH]c2ccccc12)NC(=O)[C@H](CCC(N)=O)NC(=O)COCC(=O)Nc1ccc(CC(CNCCN)CNCCN)cc1)C(C)C)C(N)=O
Show InChI InChI=1S/C62H96N18O12/c1-7-8-12-46(56(66)85)77-60(89)48(24-36(2)3)78-61(90)50(27-43-31-69-35-72-43)76-52(82)32-71-62(91)55(37(4)5)80-57(86)38(6)73-59(88)49(26-41-30-70-45-13-10-9-11-44(41)45)79-58(87)47(18-19-51(65)81)75-54(84)34-92-33-53(83)74-42-16-14-39(15-17-42)25-40(28-67-22-20-63)29-68-23-21-64/h9-11,13-17,30-31,35-38,40,46-50,55,67-68,70H,7-8,12,18-29,32-34,63-64H2,1-6H3,(H2,65,81)(H2,66,85)(H,69,72)(H,71,91)(H,73,88)(H,74,83)(H,75,84)(H,76,82)(H,77,89)(H,78,90)(H,79,87)(H,80,86)/t38-,46-,47-,48-,49-,50-,55-/m0/s1
Reactome pathway
n/an/a>100n/an/an/an/an/an/a
National Center for Scientific Research Demokritos
Curated by ChEMBL
Assay Description
Inhibition of bombesin subtype 3 receptor expressed in human lung carcinoids
J Med Chem 48: 100-10 (2005)
Article DOI: 10.1021/jm049437y
BindingDB Entry DOI: 10.7270/Q2DF6QQ6
NMBR
(Homo sapiens (Human))
BDBM50158700
(CHEMBL266079 | [(N4-Bzdig)0,Nle14]BB(7-14))
Show SMILES CCCC[C@H](NC(=O)[C@H](CC(C)C)NC(=O)[C@H](Cc1cnc[nH]1)NC(=O)CNC(=O)[C@@H](NC(=O)[C@H](C)NC(=O)[C@H](Cc1c[nH]c2ccccc12)NC(=O)[C@H](CCC(N)=O)NC(=O)COCC(=O)Nc1ccc(CC(CNCCN)CNCCN)cc1)C(C)C)C(N)=O
Show InChI InChI=1S/C62H96N18O12/c1-7-8-12-46(56(66)85)77-60(89)48(24-36(2)3)78-61(90)50(27-43-31-69-35-72-43)76-52(82)32-71-62(91)55(37(4)5)80-57(86)38(6)73-59(88)49(26-41-30-70-45-13-10-9-11-44(41)45)79-58(87)47(18-19-51(65)81)75-54(84)34-92-33-53(83)74-42-16-14-39(15-17-42)25-40(28-67-22-20-63)29-68-23-21-64/h9-11,13-17,30-31,35-38,40,46-50,55,67-68,70H,7-8,12,18-29,32-34,63-64H2,1-6H3,(H2,65,81)(H2,66,85)(H,69,72)(H,71,91)(H,73,88)(H,74,83)(H,75,84)(H,76,82)(H,77,89)(H,78,90)(H,79,87)(H,80,86)/t38-,46-,47-,48-,49-,50-,55-/m0/s1
n/an/a 2n/an/an/an/an/an/a
National Center for Scientific Research Demokritos
Curated by ChEMBL
Assay Description
Inhibition of tachykinin receptor 3 expressed in human ileal carcinoid cells
J Med Chem 48: 100-10 (2005)
Article DOI: 10.1021/jm049437y
BindingDB Entry DOI: 10.7270/Q2DF6QQ6
GRPR
(Homo sapiens (Human))
BDBM50158700
(CHEMBL266079 | [(N4-Bzdig)0,Nle14]BB(7-14))
Show SMILES CCCC[C@H](NC(=O)[C@H](CC(C)C)NC(=O)[C@H](Cc1cnc[nH]1)NC(=O)CNC(=O)[C@@H](NC(=O)[C@H](C)NC(=O)[C@H](Cc1c[nH]c2ccccc12)NC(=O)[C@H](CCC(N)=O)NC(=O)COCC(=O)Nc1ccc(CC(CNCCN)CNCCN)cc1)C(C)C)C(N)=O
Show InChI InChI=1S/C62H96N18O12/c1-7-8-12-46(56(66)85)77-60(89)48(24-36(2)3)78-61(90)50(27-43-31-69-35-72-43)76-52(82)32-71-62(91)55(37(4)5)80-57(86)38(6)73-59(88)49(26-41-30-70-45-13-10-9-11-44(41)45)79-58(87)47(18-19-51(65)81)75-54(84)34-92-33-53(83)74-42-16-14-39(15-17-42)25-40(28-67-22-20-63)29-68-23-21-64/h9-11,13-17,30-31,35-38,40,46-50,55,67-68,70H,7-8,12,18-29,32-34,63-64H2,1-6H3,(H2,65,81)(H2,66,85)(H,69,72)(H,71,91)(H,73,88)(H,74,83)(H,75,84)(H,76,82)(H,77,89)(H,78,90)(H,79,87)(H,80,86)/t38-,46-,47-,48-,49-,50-,55-/m0/s1
n/an/a 0.600n/an/an/an/an/an/a
National Center for Scientific Research Demokritos
Curated by ChEMBL
Assay Description
Displacement of [125 I-Tyr4]BB from human gastrin releasing peptide receptor expressed in PC-3 cell membranes
J Med Chem 48: 100-10 (2005)
Article DOI: 10.1021/jm049437y
BindingDB Entry DOI: 10.7270/Q2DF6QQ6