BDBM50158707 CHEMBL175758::N-(5-Chloro-2-hydroxy-phenyl)-2-{4-oxo-2-thioxo-5-[1-(3,4,5-trimethoxy-phenyl)-meth-(Z)-ylidene]-thiazolidin-3-yl}-acetamide
SMILES: COc1cc(\C=C2/SC(=S)N(CC(=O)Nc3cc(Cl)ccc3O)C2=O)cc(OC)c1OC
InChI Key: InChIKey=HWJLPBJFPGOKAC-IUXPMGMMSA-N
Data: 2 IC50
Activity Spreadsheet -- Enzyme Inhibition Constant Data from BindingDB
Found 2 hits for monomerid = 50158707
Trg + Lig
Ki
nM
ΔG°
kcal/mole
IC50
nM
Kd
nM
EC50/IC50
nM
koff
s-1
kon
M-1s-1
pHTemp
°C
Human immunodeficiency virus type 1 reverse transcriptase
(Human immunodeficiency virus 1)
BDBM50158707
(CHEMBL175758 | N-(5-Chloro-2-hydroxy-phenyl)-2-{4-...)
Show SMILES COc1cc(\C=C2/SC(=S)N(CC(=O)Nc3cc(Cl)ccc3O)C2=O)cc(OC)c1OC
Show InChI InChI=1S/C21H19ClN2O6S2/c1-28-15-6-11(7-16(29-2)19(15)30-3)8-17-20(27)24(21(31)32-17)10-18(26)23-13-9-12(22)4-5-14(13)25/h4-9,25H,10H2,1-3H3,(H,23,26)/b17-8-
n/an/a 3.20E+4n/an/an/an/an/an/a
University of Southern California
Curated by ChEMBL
Assay Description
Inhibitory concentration against human immuno deficiency virus type 1 integrase (3'-processing)
J Med Chem 48: 111-20 (2005)
Article DOI: 10.1021/jm0496077
BindingDB Entry DOI: 10.7270/Q28S4PD6
Human immunodeficiency virus type 1 reverse transcriptase
(Human immunodeficiency virus 1)
BDBM50158707
(CHEMBL175758 | N-(5-Chloro-2-hydroxy-phenyl)-2-{4-...)
Show SMILES COc1cc(\C=C2/SC(=S)N(CC(=O)Nc3cc(Cl)ccc3O)C2=O)cc(OC)c1OC
Show InChI InChI=1S/C21H19ClN2O6S2/c1-28-15-6-11(7-16(29-2)19(15)30-3)8-17-20(27)24(21(31)32-17)10-18(26)23-13-9-12(22)4-5-14(13)25/h4-9,25H,10H2,1-3H3,(H,23,26)/b17-8-
n/an/a 1.70E+4n/an/an/an/an/an/a
University of Southern California
Curated by ChEMBL
Assay Description
Inhibitory concentration against human immuno deficiency virus type 1 integrase (Strand Transfer)
J Med Chem 48: 111-20 (2005)
Article DOI: 10.1021/jm0496077
BindingDB Entry DOI: 10.7270/Q28S4PD6