BDBM50158737 3-(2-{5-[1-(2-Chloro-phenyl)-meth-(Z)-ylidene]-4-oxo-2-thioxo-thiazolidin-3-yl}-acetylamino)-benzoic acid::CHEMBL179045
SMILES: OC(=O)c1cccc(NC(=O)CN2C(=S)S\C(=C/c3ccccc3Cl)C2=O)c1
InChI Key: InChIKey=OFZQHXJUMSLIOY-DHDCSXOGSA-N
Data: 2 IC50
Activity Spreadsheet -- Enzyme Inhibition Constant Data from BindingDB
Found 2 hits for monomerid = 50158737
Trg + Lig
Ki
nM
ΔG°
kcal/mole
IC50
nM
Kd
nM
EC50/IC50
nM
koff
s-1
kon
M-1s-1
pHTemp
°C
Human immunodeficiency virus type 1 reverse transcriptase
(Human immunodeficiency virus 1)
BDBM50158737
(3-(2-{5-[1-(2-Chloro-phenyl)-meth-(Z)-ylidene]-4-o...)
Show SMILES OC(=O)c1cccc(NC(=O)CN2C(=S)S\C(=C/c3ccccc3Cl)C2=O)c1
Show InChI InChI=1S/C19H13ClN2O4S2/c20-14-7-2-1-4-11(14)9-15-17(24)22(19(27)28-15)10-16(23)21-13-6-3-5-12(8-13)18(25)26/h1-9H,10H2,(H,21,23)(H,25,26)/b15-9-
n/an/a>1.00E+5n/an/an/an/an/an/a
University of Southern California
Curated by ChEMBL
Assay Description
Inhibitory concentration against human immuno deficiency virus type 1 integrase (3'-processing)
J Med Chem 48: 111-20 (2005)
Article DOI: 10.1021/jm0496077
BindingDB Entry DOI: 10.7270/Q28S4PD6
Human immunodeficiency virus type 1 reverse transcriptase
(Human immunodeficiency virus 1)
BDBM50158737
(3-(2-{5-[1-(2-Chloro-phenyl)-meth-(Z)-ylidene]-4-o...)
Show SMILES OC(=O)c1cccc(NC(=O)CN2C(=S)S\C(=C/c3ccccc3Cl)C2=O)c1
Show InChI InChI=1S/C19H13ClN2O4S2/c20-14-7-2-1-4-11(14)9-15-17(24)22(19(27)28-15)10-16(23)21-13-6-3-5-12(8-13)18(25)26/h1-9H,10H2,(H,21,23)(H,25,26)/b15-9-
n/an/a>1.00E+5n/an/an/an/an/an/a
University of Southern California
Curated by ChEMBL
Assay Description
Inhibitory concentration against human immuno deficiency virus type 1 integrase (Strand Transfer)
J Med Chem 48: 111-20 (2005)
Article DOI: 10.1021/jm0496077
BindingDB Entry DOI: 10.7270/Q28S4PD6