null
SMILES: OC(=O)c1cc(NC(=O)CCN2C(=S)S\C(=C/c3cccs3)C2=O)ccc1O
InChI Key: InChIKey=LBLMAQXNQCNDRL-ZROIWOOFSA-N
Activity Spreadsheet -- Enzyme Inhibition Constant Data from BindingDB
Found 2 hits for monomerid = 50158747
Trg + Lig
Ki
nM
ΔG°
kcal/mole
IC50
nM
Kd
nM
EC50/IC50
nM
koff
s-1
kon
M-1s-1
pHTemp
°C
Reverse transcriptase/RNaseH
(Human immunodeficiency virus 1)
BDBM50158747
(2-Hydroxy-5-(3-{4-oxo-5-[1-thiophen-2-yl-meth-(Z)-...)
Show SMILES OC(=O)c1cc(NC(=O)CCN2C(=S)S\C(=C/c3cccs3)C2=O)ccc1O
Show InChI InChI=1S/C18H14N2O5S3/c21-13-4-3-10(8-12(13)17(24)25)19-15(22)5-6-20-16(23)14(28-18(20)26)9-11-2-1-7-27-11/h1-4,7-9,21H,5-6H2,(H,19,22)(H,24,25)/b14-9-
n/an/a 3.80E+4n/an/an/an/an/an/a
University of Southern California
Curated by ChEMBL
Assay Description
Inhibitory concentration against human immuno deficiency virus type 1 integrase (3'-processing)
J Med Chem 48: 111-20 (2005)
Article DOI: 10.1021/jm0496077
BindingDB Entry DOI: 10.7270/Q28S4PD6
Reverse transcriptase/RNaseH
(Human immunodeficiency virus 1)
BDBM50158747
(2-Hydroxy-5-(3-{4-oxo-5-[1-thiophen-2-yl-meth-(Z)-...)
Show SMILES OC(=O)c1cc(NC(=O)CCN2C(=S)S\C(=C/c3cccs3)C2=O)ccc1O
Show InChI InChI=1S/C18H14N2O5S3/c21-13-4-3-10(8-12(13)17(24)25)19-15(22)5-6-20-16(23)14(28-18(20)26)9-11-2-1-7-27-11/h1-4,7-9,21H,5-6H2,(H,19,22)(H,24,25)/b14-9-
n/an/a 3.80E+4n/an/an/an/an/an/a
University of Southern California
Curated by ChEMBL
Assay Description
Inhibitory concentration against human immuno deficiency virus type 1 integrase (Strand Transfer)
J Med Chem 48: 111-20 (2005)
Article DOI: 10.1021/jm0496077
BindingDB Entry DOI: 10.7270/Q28S4PD6