null
SMILES: Cc1onc(c1C(=O)c1ccc(O)c(c1)C(O)=O)-c1ccccc1Cl
InChI Key: InChIKey=NSCWRVACCREZFT-UHFFFAOYSA-N
Activity Spreadsheet -- Enzyme Inhibition Constant Data from BindingDB
Found 2 hits for monomerid = 50158751
Trg + Lig
Ki
nM
ΔG°
kcal/mole
IC50
nM
Kd
nM
EC50/IC50
nM
koff
s-1
kon
M-1s-1
pHTemp
°C
Reverse transcriptase/RNaseH
(Human immunodeficiency virus 1)
BDBM50158751
(5-[3-(2-Chloro-phenyl)-5-methyl-isoxazole-4-carbon...)
Show SMILES Cc1onc(c1C(=O)c1ccc(O)c(c1)C(O)=O)-c1ccccc1Cl
Show InChI InChI=1S/C18H12ClNO5/c1-9-15(16(20-25-9)11-4-2-3-5-13(11)19)17(22)10-6-7-14(21)12(8-10)18(23)24/h2-8,21H,1H3,(H,23,24)
n/an/a 1.00E+5n/an/an/an/an/an/a
University of Southern California
Curated by ChEMBL
Assay Description
Inhibitory concentration against human immuno deficiency virus type 1 integrase (3'-processing)
J Med Chem 48: 111-20 (2005)
Article DOI: 10.1021/jm0496077
BindingDB Entry DOI: 10.7270/Q28S4PD6
Reverse transcriptase/RNaseH
(Human immunodeficiency virus 1)
BDBM50158751
(5-[3-(2-Chloro-phenyl)-5-methyl-isoxazole-4-carbon...)
Show SMILES Cc1onc(c1C(=O)c1ccc(O)c(c1)C(O)=O)-c1ccccc1Cl
Show InChI InChI=1S/C18H12ClNO5/c1-9-15(16(20-25-9)11-4-2-3-5-13(11)19)17(22)10-6-7-14(21)12(8-10)18(23)24/h2-8,21H,1H3,(H,23,24)
n/an/a 1.00E+5n/an/an/an/an/an/a
University of Southern California
Curated by ChEMBL
Assay Description
Inhibitory concentration against human immuno deficiency virus type 1 integrase (Strand Transfer)
J Med Chem 48: 111-20 (2005)
Article DOI: 10.1021/jm0496077
BindingDB Entry DOI: 10.7270/Q28S4PD6