BDBM50158754 4-[3-(2-Carboxy-vinyl)-4,5-dimethoxy-benzenesulfonylamino]-2-hydroxy-benzoic acid::CHEMBL177335
SMILES: COc1cc(cc(\C=C\C(O)=O)c1OC)S(=O)(=O)Nc1ccc(C(O)=O)c(O)c1
InChI Key: InChIKey=DDADCKODBROBHB-ZZXKWVIFSA-N
Data: 2 IC50
Activity Spreadsheet -- Enzyme Inhibition Constant Data from BindingDB
Found 2 hits for monomerid = 50158754
Trg + Lig
Ki
nM
ΔG°
kcal/mole
IC50
nM
Kd
nM
EC50/IC50
nM
koff
s-1
kon
M-1s-1
pHTemp
°C
Reverse transcriptase/RNaseH
(Human immunodeficiency virus 1)
BDBM50158754
(4-[3-(2-Carboxy-vinyl)-4,5-dimethoxy-benzenesulfon...)
Show SMILES COc1cc(cc(\C=C\C(O)=O)c1OC)S(=O)(=O)Nc1ccc(C(O)=O)c(O)c1
Show InChI InChI=1S/C18H17NO9S/c1-27-15-9-12(7-10(17(15)28-2)3-6-16(21)22)29(25,26)19-11-4-5-13(18(23)24)14(20)8-11/h3-9,19-20H,1-2H3,(H,21,22)(H,23,24)/b6-3+
n/an/a 7.80E+4n/an/an/an/an/an/a
University of Southern California
Curated by ChEMBL
Assay Description
Inhibitory concentration against human immuno deficiency virus type 1 integrase (3'-processing)
J Med Chem 48: 111-20 (2005)
Article DOI: 10.1021/jm0496077
BindingDB Entry DOI: 10.7270/Q28S4PD6
Reverse transcriptase/RNaseH
(Human immunodeficiency virus 1)
BDBM50158754
(4-[3-(2-Carboxy-vinyl)-4,5-dimethoxy-benzenesulfon...)
Show SMILES COc1cc(cc(\C=C\C(O)=O)c1OC)S(=O)(=O)Nc1ccc(C(O)=O)c(O)c1
Show InChI InChI=1S/C18H17NO9S/c1-27-15-9-12(7-10(17(15)28-2)3-6-16(21)22)29(25,26)19-11-4-5-13(18(23)24)14(20)8-11/h3-9,19-20H,1-2H3,(H,21,22)(H,23,24)/b6-3+
n/an/a 7.50E+4n/an/an/an/an/an/a
University of Southern California
Curated by ChEMBL
Assay Description
Inhibitory concentration against human immuno deficiency virus type 1 integrase (Strand Transfer)
J Med Chem 48: 111-20 (2005)
Article DOI: 10.1021/jm0496077
BindingDB Entry DOI: 10.7270/Q28S4PD6