null
SMILES: COC(=O)c1ccnc(c1)-n1nccc1OCc1ccc(Cl)cc1
InChI Key: InChIKey=CDSIWRGJSKHJRV-UHFFFAOYSA-N
Activity Spreadsheet -- Enzyme Inhibition Constant Data from BindingDB
Found 2 hits for monomerid = 50158812
Trg + Lig
Ki
nM
ΔG°
kcal/mole
IC50
nM
Kd
nM
EC50/IC50
nM
koff
s-1
kon
M-1s-1
pHTemp
°C
Lysine-specific demethylase 5B
(Homo sapiens (Human))
BDBM50158812
(CHEMBL3786987)
Show SMILES COC(=O)c1ccnc(c1)-n1nccc1OCc1ccc(Cl)cc1
Show InChI InChI=1S/C17H14ClN3O3/c1-23-17(22)13-6-8-19-15(10-13)21-16(7-9-20-21)24-11-12-2-4-14(18)5-3-12/h2-10H,11H2,1H3
n/an/a 100n/an/an/an/an/an/a
University of Oxford
Curated by ChEMBL
Assay Description
Inhibition of KDM5B in human ZR-75-1 cells assessed as reduction in H3K4me3 demethylation incubated for 72 hrs by fluorometric immunoassay
J Med Chem 59: 1308-29 (2016)
BindingDB Entry DOI: 10.7270/Q2MP5559
Lysine-specific demethylase 5A
(Homo sapiens (Human))
BDBM50158812
(CHEMBL3786987)
Show SMILES COC(=O)c1ccnc(c1)-n1nccc1OCc1ccc(Cl)cc1
Show InChI InChI=1S/C17H14ClN3O3/c1-23-17(22)13-6-8-19-15(10-13)21-16(7-9-20-21)24-11-12-2-4-14(18)5-3-12/h2-10H,11H2,1H3
Reactome pathway
n/an/a 100n/an/an/an/an/an/a
University of Oxford
Curated by ChEMBL
Assay Description
Inhibition of KDM5A in human ZR-75-1 cells assessed as reduction in H3K4me3 demethylation incubated for 72 hrs by fluorometric immunoassay
J Med Chem 59: 1308-29 (2016)
BindingDB Entry DOI: 10.7270/Q2MP5559