BDBM50159041 Ac-I[CVYQDWGAHRC]T-NH2::CHEMBL268084
SMILES: CC[C@H](C)[C@H](NC(C)=O)C(=O)N[C@H]1CSSC[C@H](NC(=O)[C@H](CCCNC(N)=N)NC(=O)[C@@H](Cc2cnc[nH]2)NC(=O)[C@H](C)NC(=O)CNC(=O)[C@H](Cc2c[nH]c3ccccc23)NC(=O)[C@@H](CC(O)=O)NC(=O)[C@H](CCC(N)=O)NC(=O)[C@@H](Cc2ccc(O)cc2)NC(=O)[C@@H](NC1=O)C(C)C)C(=O)N[C@@H]([C@@H](C)O)C(N)=O
InChI Key: InChIKey=PQVLDHFPSLWLQN-VEMXNSRSSA-N
Data: 1 IC50
Activity Spreadsheet -- Enzyme Inhibition Constant Data from BindingDB
Found 1 hit for monomerid = 50159041
Trg + Lig
Ki
nM
ΔG°
kcal/mole
IC50
nM
Kd
nM
EC50/IC50
nM
koff
s-1
kon
M-1s-1
pHTemp
°C
Complement C3
(Homo sapiens (Human))
BDBM50159041
(Ac-I[CVYQDWGAHRC]T-NH2 | CHEMBL268084)
Show SMILES CC[C@H](C)[C@H](NC(C)=O)C(=O)N[C@H]1CSSC[C@H](NC(=O)[C@H](CCCNC(N)=N)NC(=O)[C@@H](Cc2cnc[nH]2)NC(=O)[C@H](C)NC(=O)CNC(=O)[C@H](Cc2c[nH]c3ccccc23)NC(=O)[C@@H](CC(O)=O)NC(=O)[C@H](CCC(N)=O)NC(=O)[C@@H](Cc2ccc(O)cc2)NC(=O)[C@@H](NC1=O)C(C)C)C(=O)N[C@@H]([C@@H](C)O)C(N)=O
Show InChI InChI=1S/C69H99N21O19S2/c1-8-33(4)55(80-36(7)92)68(109)88-50-30-111-110-29-49(66(107)90-56(35(6)91)57(71)98)87-60(101)43(14-11-21-75-69(72)73)81-63(104)47(24-39-27-74-31-78-39)83-58(99)34(5)79-52(95)28-77-59(100)46(23-38-26-76-42-13-10-9-12-41(38)42)84-64(105)48(25-53(96)97)85-61(102)44(19-20-51(70)94)82-62(103)45(22-37-15-17-40(93)18-16-37)86-67(108)54(32(2)3)89-65(50)106/h9-10,12-13,15-18,26-27,31-35,43-50,54-56,76,91,93H,8,11,14,19-25,28-30H2,1-7H3,(H2,70,94)(H2,71,98)(H,74,78)(H,77,100)(H,79,95)(H,80,92)(H,81,104)(H,82,103)(H,83,99)(H,84,105)(H,85,102)(H,86,108)(H,87,101)(H,88,109)(H,89,106)(H,90,107)(H,96,97)(H4,72,73,75)/t33-,34-,35+,43-,44-,45+,46-,47+,48+,49-,50-,54-,55-,56-/m0/s1
n/an/a 3.00E+3n/an/an/an/an/an/a
University of California at Riverside
Curated by ChEMBL
Assay Description
Inhibitory concentration for human complement component C3 activation
J Med Chem 48: 274-86 (2005)
Article DOI: 10.1021/jm0495531
BindingDB Entry DOI: 10.7270/Q2DR2W81