BDBM50159044 Ac-I[CVTQDWGHHRC]T-NH2::CHEMBL414283
SMILES: CC[C@H](C)[C@H](NC(C)=O)C(=O)N[C@H]1CSSC[C@H](NC(=O)[C@H](CCCNC(N)=N)NC(=O)[C@@H](Cc2cnc[nH]2)NC(=O)[C@H](Cc2cnc[nH]2)NC(=O)CNC(=O)[C@H](Cc2c[nH]c3ccccc23)NC(=O)[C@@H](CC(O)=O)NC(=O)[C@H](CCC(N)=O)NC(=O)[C@H](NC(=O)[C@@H](NC1=O)C(C)C)[C@@H](C)O)C(=O)N[C@@H]([C@@H](C)O)C(N)=O
InChI Key: InChIKey=VOXWWAJOYBYONB-RTTZVKIOSA-N
Data: 1 IC50
Activity Spreadsheet -- Enzyme Inhibition Constant Data from BindingDB
Found 1 hit for monomerid = 50159044
Trg + Lig
Ki
nM
ΔG°
kcal/mole
IC50
nM
Kd
nM
EC50/IC50
nM
koff
s-1
kon
M-1s-1
pHTemp
°C
Complement C3
(Homo sapiens (Human))
BDBM50159044
(Ac-I[CVTQDWGHHRC]T-NH2 | CHEMBL414283)
Show SMILES CC[C@H](C)[C@H](NC(C)=O)C(=O)N[C@H]1CSSC[C@H](NC(=O)[C@H](CCCNC(N)=N)NC(=O)[C@@H](Cc2cnc[nH]2)NC(=O)[C@H](Cc2cnc[nH]2)NC(=O)CNC(=O)[C@H](Cc2c[nH]c3ccccc23)NC(=O)[C@@H](CC(O)=O)NC(=O)[C@H](CCC(N)=O)NC(=O)[C@H](NC(=O)[C@@H](NC1=O)C(C)C)[C@@H](C)O)C(=O)N[C@@H]([C@@H](C)O)C(N)=O
Show InChI InChI=1S/C67H99N23O19S2/c1-8-31(4)52(79-34(7)93)65(108)87-47-27-111-110-26-46(63(106)89-53(32(5)91)55(69)98)86-57(100)40(14-11-17-74-67(70)71)81-60(103)44(20-37-24-73-29-78-37)84-59(102)43(19-36-23-72-28-77-36)80-49(95)25-76-56(99)42(18-35-22-75-39-13-10-9-12-38(35)39)83-61(104)45(21-50(96)97)85-58(101)41(15-16-48(68)94)82-66(109)54(33(6)92)90-64(107)51(30(2)3)88-62(47)105/h9-10,12-13,22-24,28-33,40-47,51-54,75,91-92H,8,11,14-21,25-27H2,1-7H3,(H2,68,94)(H2,69,98)(H,72,77)(H,73,78)(H,76,99)(H,79,93)(H,80,95)(H,81,103)(H,82,109)(H,83,104)(H,84,102)(H,85,101)(H,86,100)(H,87,108)(H,88,105)(H,89,106)(H,90,107)(H,96,97)(H4,70,71,74)/t31-,32+,33+,40-,41-,42-,43-,44+,45+,46-,47-,51-,52-,53-,54+/m0/s1
n/an/a 6.00E+3n/an/an/an/an/an/a
University of California at Riverside
Curated by ChEMBL
Assay Description
Inhibitory concentration for human complement component C3 activation
J Med Chem 48: 274-86 (2005)
Article DOI: 10.1021/jm0495531
BindingDB Entry DOI: 10.7270/Q2DR2W81