BDBM50159063 Ac-I[CV(Bpa)QDWGAHRC]T::CHEMBL263817
SMILES: CC[C@H](C)[C@H](NC(C)=O)C(=O)N[C@H]1CSSC[C@H](NC(=O)[C@H](CCCNC(N)=N)NC(=O)[C@@H](Cc2cnc[nH]2)NC(=O)[C@H](C)NC(=O)CNC(=O)[C@H](Cc2c[nH]c3ccccc23)NC(=O)C(CC(O)=O)NC(=O)[C@H](CCC(N)=O)NC(=O)[C@H](Cc2ccc(cc2)C(=O)c2ccccc2)NC(=O)[C@@H](NC1=O)C(C)C)C(=O)N[C@@H]([C@@H](C)O)C(O)=O
InChI Key: InChIKey=PWSUDTBGJHZYGB-MPCJNSQXSA-N
Data: 1 IC50
Activity Spreadsheet -- Enzyme Inhibition Constant Data from BindingDB
Found 1 hit for monomerid = 50159063
Trg + Lig
Ki
nM
ΔG°
kcal/mole
IC50
nM
Kd
nM
EC50/IC50
nM
koff
s-1
kon
M-1s-1
pHTemp
°C
Complement C3
(Homo sapiens (Human))
BDBM50159063
(Ac-I[CV(Bpa)QDWGAHRC]T | CHEMBL263817)
Show SMILES CC[C@H](C)[C@H](NC(C)=O)C(=O)N[C@H]1CSSC[C@H](NC(=O)[C@H](CCCNC(N)=N)NC(=O)[C@@H](Cc2cnc[nH]2)NC(=O)[C@H](C)NC(=O)CNC(=O)[C@H](Cc2c[nH]c3ccccc23)NC(=O)C(CC(O)=O)NC(=O)[C@H](CCC(N)=O)NC(=O)[C@H](Cc2ccc(cc2)C(=O)c2ccccc2)NC(=O)[C@@H](NC1=O)C(C)C)C(=O)N[C@@H]([C@@H](C)O)C(O)=O
Show InChI InChI=1S/C76H102N20O20S2/c1-8-38(4)61(86-41(7)98)74(114)94-56-35-118-117-34-55(72(112)96-62(40(6)97)75(115)116)93-66(106)49(19-14-26-81-76(78)79)87-69(109)53(29-46-32-80-36-84-46)89-64(104)39(5)85-58(100)33-83-65(105)52(28-45-31-82-48-18-13-12-17-47(45)48)90-70(110)54(30-59(101)102)91-67(107)50(24-25-57(77)99)88-68(108)51(92-73(113)60(37(2)3)95-71(56)111)27-42-20-22-44(23-21-42)63(103)43-15-10-9-11-16-43/h9-13,15-18,20-23,31-32,36-40,49-56,60-62,82,97H,8,14,19,24-30,33-35H2,1-7H3,(H2,77,99)(H,80,84)(H,83,105)(H,85,100)(H,86,98)(H,87,109)(H,88,108)(H,89,104)(H,90,110)(H,91,107)(H,92,113)(H,93,106)(H,94,114)(H,95,111)(H,96,112)(H,101,102)(H,115,116)(H4,78,79,81)/t38-,39-,40+,49-,50-,51-,52-,53+,54?,55-,56-,60-,61-,62-/m0/s1
n/an/a 1.10E+3n/an/an/an/an/an/a
University of California at Riverside
Curated by ChEMBL
Assay Description
Inhibitory concentration for human complement component C3 activation
J Med Chem 48: 274-86 (2005)
Article DOI: 10.1021/jm0495531
BindingDB Entry DOI: 10.7270/Q2DR2W81