BDBM50159156 CHEMBL3786291
SMILES: OC(=O)C(F)(F)F.OC(=O)C(F)(F)F.OC(=O)C(F)(F)F.CC[C@H](C)[C@H](NC(=O)[C@H](Cc1ccc(O)cc1)NC(=O)[C@@H]1CCCN1C(=O)[C@H](CCCNC(N)=N)NC(=O)[C@@H](N)CCCN\C(N)=N\C(=O)NCCCCNC(=O)CC)C(=O)N[C@@H](CC(C)C)C(O)=O
InChI Key: InChIKey=WTDUWQNEJCZMGU-QBPHBUSHSA-N
Data: 3 KI  1 IC50  2 EC50
Activity Spreadsheet -- Enzyme Inhibition Constant Data from BindingDB
Found 6 hits for monomerid = 50159156
Trg + Lig
Ki
nM
ΔG°
kcal/mole
IC50
nM
Kd
nM
EC50/IC50
nM
koff
s-1
kon
M-1s-1
pHTemp
°C
Dopamine receptor D2L/neurotensin receptor NTS1
(Homo sapiens (Human))
BDBM50159156
(CHEMBL3786291)
Show SMILES OC(=O)C(F)(F)F.OC(=O)C(F)(F)F.OC(=O)C(F)(F)F.CC[C@H](C)[C@H](NC(=O)[C@H](Cc1ccc(O)cc1)NC(=O)[C@@H]1CCCN1C(=O)[C@H](CCCNC(N)=N)NC(=O)[C@@H](N)CCCN\C(N)=N\C(=O)NCCCCNC(=O)CC)C(=O)N[C@@H](CC(C)C)C(O)=O |r|
Show InChI InChI=1S/C46H78N14O10.3C2HF3O2/c1-6-28(5)37(41(66)57-34(43(68)69)25-27(3)4)58-39(64)33(26-29-16-18-30(61)19-17-29)56-40(65)35-15-12-24-60(35)42(67)32(14-11-22-52-44(48)49)55-38(63)31(47)13-10-23-53-45(50)59-46(70)54-21-9-8-20-51-36(62)7-2;3*3-2(4,5)1(6)7/h16-19,27-28,31-35,37,61H,6-15,20-26,47H2,1-5H3,(H,51,62)(H,55,63)(H,56,65)(H,57,66)(H,58,64)(H,68,69)(H4,48,49,52)(H4,50,53,54,59,70);3*(H,6,7)/t28-,31-,32-,33-,34-,35-,37-;;;/m0.../s1
Reactome pathway
0.470n/an/an/an/an/an/an/an/a
University of Regensburg
Curated by ChEMBL
Assay Description
Displacement of [3H]-{Nomega-[N-(4-propanoylaminobutyl)aminocarbonyl]}Arg-Arg-ProTyr-Ile-Leu-OH Tris(hydrotrifluoroacetate) from NTSR1 in human HT-29...
J Med Chem 59: 1925-45 (2016)
BindingDB Entry DOI: 10.7270/Q2V69MGK
Dopamine receptor D2L/neurotensin receptor NTS1
(Homo sapiens (Human))
BDBM50159156
(CHEMBL3786291)
Show SMILES OC(=O)C(F)(F)F.OC(=O)C(F)(F)F.OC(=O)C(F)(F)F.CC[C@H](C)[C@H](NC(=O)[C@H](Cc1ccc(O)cc1)NC(=O)[C@@H]1CCCN1C(=O)[C@H](CCCNC(N)=N)NC(=O)[C@@H](N)CCCN\C(N)=N\C(=O)NCCCCNC(=O)CC)C(=O)N[C@@H](CC(C)C)C(O)=O |r|
Show InChI InChI=1S/C46H78N14O10.3C2HF3O2/c1-6-28(5)37(41(66)57-34(43(68)69)25-27(3)4)58-39(64)33(26-29-16-18-30(61)19-17-29)56-40(65)35-15-12-24-60(35)42(67)32(14-11-22-52-44(48)49)55-38(63)31(47)13-10-23-53-45(50)59-46(70)54-21-9-8-20-51-36(62)7-2;3*3-2(4,5)1(6)7/h16-19,27-28,31-35,37,61H,6-15,20-26,47H2,1-5H3,(H,51,62)(H,55,63)(H,56,65)(H,57,66)(H,58,64)(H,68,69)(H4,48,49,52)(H4,50,53,54,59,70);3*(H,6,7)/t28-,31-,32-,33-,34-,35-,37-;;;/m0.../s1
Reactome pathway
0.630n/an/an/an/an/an/an/an/a
University of Regensburg
Curated by ChEMBL
Assay Description
Displacement of [3H]-{Nomega-[N-(4-propanoylaminobutyl)aminocarbonyl]}Arg-Arg-ProTyr-Ile-Leu-OH Tris(hydrotrifluoroacetate) from human NTSR1 transfec...
J Med Chem 59: 1925-45 (2016)
BindingDB Entry DOI: 10.7270/Q2V69MGK
Neurotensin receptor
(Homo sapiens (Human))
BDBM50159156
(CHEMBL3786291)
Show SMILES OC(=O)C(F)(F)F.OC(=O)C(F)(F)F.OC(=O)C(F)(F)F.CC[C@H](C)[C@H](NC(=O)[C@H](Cc1ccc(O)cc1)NC(=O)[C@@H]1CCCN1C(=O)[C@H](CCCNC(N)=N)NC(=O)[C@@H](N)CCCN\C(N)=N\C(=O)NCCCCNC(=O)CC)C(=O)N[C@@H](CC(C)C)C(O)=O |r|
Show InChI InChI=1S/C46H78N14O10.3C2HF3O2/c1-6-28(5)37(41(66)57-34(43(68)69)25-27(3)4)58-39(64)33(26-29-16-18-30(61)19-17-29)56-40(65)35-15-12-24-60(35)42(67)32(14-11-22-52-44(48)49)55-38(63)31(47)13-10-23-53-45(50)59-46(70)54-21-9-8-20-51-36(62)7-2;3*3-2(4,5)1(6)7/h16-19,27-28,31-35,37,61H,6-15,20-26,47H2,1-5H3,(H,51,62)(H,55,63)(H,56,65)(H,57,66)(H,58,64)(H,68,69)(H4,48,49,52)(H4,50,53,54,59,70);3*(H,6,7)/t28-,31-,32-,33-,34-,35-,37-;;;/m0.../s1
Reactome pathway
2.5n/an/an/an/an/an/an/an/a
University of Regensburg
Curated by ChEMBL
Assay Description
Displacement of [3H]NT(8 to 13 residues) from human NTSR2 expressed in HEK293 cell membranes
J Med Chem 59: 1925-45 (2016)
BindingDB Entry DOI: 10.7270/Q2V69MGK
Dopamine receptor D2L/neurotensin receptor NTS1
(Homo sapiens (Human))
BDBM50159156
(CHEMBL3786291)
Show SMILES OC(=O)C(F)(F)F.OC(=O)C(F)(F)F.OC(=O)C(F)(F)F.CC[C@H](C)[C@H](NC(=O)[C@H](Cc1ccc(O)cc1)NC(=O)[C@@H]1CCCN1C(=O)[C@H](CCCNC(N)=N)NC(=O)[C@@H](N)CCCN\C(N)=N\C(=O)NCCCCNC(=O)CC)C(=O)N[C@@H](CC(C)C)C(O)=O |r|
Show InChI InChI=1S/C46H78N14O10.3C2HF3O2/c1-6-28(5)37(41(66)57-34(43(68)69)25-27(3)4)58-39(64)33(26-29-16-18-30(61)19-17-29)56-40(65)35-15-12-24-60(35)42(67)32(14-11-22-52-44(48)49)55-38(63)31(47)13-10-23-53-45(50)59-46(70)54-21-9-8-20-51-36(62)7-2;3*3-2(4,5)1(6)7/h16-19,27-28,31-35,37,61H,6-15,20-26,47H2,1-5H3,(H,51,62)(H,55,63)(H,56,65)(H,57,66)(H,58,64)(H,68,69)(H4,48,49,52)(H4,50,53,54,59,70);3*(H,6,7)/t28-,31-,32-,33-,34-,35-,37-;;;/m0.../s1
Reactome pathway
n/an/an/an/a 2n/an/an/an/a
University of Regensburg
Curated by ChEMBL
Assay Description
Agonist activity at NTSR1 in human HT-29 cells assessed as induction of intracellular Ca2+ mobilization by fura-2 dye-based spectrofluorimetric analy...
J Med Chem 59: 1925-45 (2016)
BindingDB Entry DOI: 10.7270/Q2V69MGK
Dopamine receptor D2L/neurotensin receptor NTS1
(Homo sapiens (Human))
BDBM50159156
(CHEMBL3786291)
Show SMILES OC(=O)C(F)(F)F.OC(=O)C(F)(F)F.OC(=O)C(F)(F)F.CC[C@H](C)[C@H](NC(=O)[C@H](Cc1ccc(O)cc1)NC(=O)[C@@H]1CCCN1C(=O)[C@H](CCCNC(N)=N)NC(=O)[C@@H](N)CCCN\C(N)=N\C(=O)NCCCCNC(=O)CC)C(=O)N[C@@H](CC(C)C)C(O)=O |r|
Show InChI InChI=1S/C46H78N14O10.3C2HF3O2/c1-6-28(5)37(41(66)57-34(43(68)69)25-27(3)4)58-39(64)33(26-29-16-18-30(61)19-17-29)56-40(65)35-15-12-24-60(35)42(67)32(14-11-22-52-44(48)49)55-38(63)31(47)13-10-23-53-45(50)59-46(70)54-21-9-8-20-51-36(62)7-2;3*3-2(4,5)1(6)7/h16-19,27-28,31-35,37,61H,6-15,20-26,47H2,1-5H3,(H,51,62)(H,55,63)(H,56,65)(H,57,66)(H,58,64)(H,68,69)(H4,48,49,52)(H4,50,53,54,59,70);3*(H,6,7)/t28-,31-,32-,33-,34-,35-,37-;;;/m0.../s1
Reactome pathway
n/an/a 1.30n/an/an/an/an/an/a
University of Regensburg
Curated by ChEMBL
Assay Description
Displacement of [3H]-{Nomega-[N-(4-propanoylaminobutyl)aminocarbonyl]}Arg-Arg-ProTyr-Ile-Leu-OH Tris(hydrotrifluoroacetate) from NTSR1 in human HT-29...
J Med Chem 59: 1925-45 (2016)
BindingDB Entry DOI: 10.7270/Q2V69MGK
Dopamine receptor D2L/neurotensin receptor NTS1
(Homo sapiens (Human))
BDBM50159156
(CHEMBL3786291)
Show SMILES OC(=O)C(F)(F)F.OC(=O)C(F)(F)F.OC(=O)C(F)(F)F.CC[C@H](C)[C@H](NC(=O)[C@H](Cc1ccc(O)cc1)NC(=O)[C@@H]1CCCN1C(=O)[C@H](CCCNC(N)=N)NC(=O)[C@@H](N)CCCN\C(N)=N\C(=O)NCCCCNC(=O)CC)C(=O)N[C@@H](CC(C)C)C(O)=O |r|
Show InChI InChI=1S/C46H78N14O10.3C2HF3O2/c1-6-28(5)37(41(66)57-34(43(68)69)25-27(3)4)58-39(64)33(26-29-16-18-30(61)19-17-29)56-40(65)35-15-12-24-60(35)42(67)32(14-11-22-52-44(48)49)55-38(63)31(47)13-10-23-53-45(50)59-46(70)54-21-9-8-20-51-36(62)7-2;3*3-2(4,5)1(6)7/h16-19,27-28,31-35,37,61H,6-15,20-26,47H2,1-5H3,(H,51,62)(H,55,63)(H,56,65)(H,57,66)(H,58,64)(H,68,69)(H4,48,49,52)(H4,50,53,54,59,70);3*(H,6,7)/t28-,31-,32-,33-,34-,35-,37-;;;/m0.../s1
Reactome pathway
n/an/an/an/a 2n/an/an/an/a
University of Regensburg
Curated by ChEMBL
Assay Description
Agonist activity at NTSR1 in human HT-29 cells assessed as induction of intracellular Ca2+ mobilization by fura-2 dye-based spectrofluorimetric analy...
J Med Chem 59: 1925-45 (2016)
BindingDB Entry DOI: 10.7270/Q2V69MGK