BDBM50159267 2-(4-methylphenyl)ethylamine::2-p-Tolyl-ethylamine::CHEMBL103299
SMILES: Cc1ccc(CCN)cc1
InChI Key: InChIKey=VKJXAQYPOTYDLO-UHFFFAOYSA-N
Data: 3 IC50  1 EC50
Activity Spreadsheet -- Enzyme Inhibition Constant Data from BindingDB
Found 4 hits for monomerid = 50159267
Trg + Lig
Ki
nM
ΔG°
kcal/mole
IC50
nM
Kd
nM
EC50/IC50
nM
koff
s-1
kon
M-1s-1
pHTemp
°C
Cytochrome P450 2A6
(Homo sapiens (Human))
BDBM50159267
(2-(4-methylphenyl)ethylamine | 2-p-Tolyl-ethylamin...)
Show SMILES Cc1ccc(CCN)cc1
Show InChI InChI=1S/C9H13N/c1-8-2-4-9(5-3-8)6-7-10/h2-5H,6-7,10H2,1H3
Reactome pathway
n/an/a 5.30E+3n/an/an/an/an/an/a
University of Kuopio
Curated by ChEMBL
Assay Description
Inhibitory concentration against human cytochrome P450 2A6
J Med Chem 48: 440-9 (2005)
Article DOI: 10.1021/jm049536b
BindingDB Entry DOI: 10.7270/Q20C4WJV
Cytochrome P450 1A
(Homo sapiens (Human))
BDBM50159267
(2-(4-methylphenyl)ethylamine | 2-p-Tolyl-ethylamin...)
Show SMILES Cc1ccc(CCN)cc1
Show InChI InChI=1S/C9H13N/c1-8-2-4-9(5-3-8)6-7-10/h2-5H,6-7,10H2,1H3
Reactome pathway
n/an/a 1.40E+4n/an/an/an/an/an/a
University of Kuopio
Curated by ChEMBL
Assay Description
Inhibitory concentration against recombinant human cytochrome P450 1A2
J Med Chem 48: 3808-15 (2005)
Article DOI: 10.1021/jm0489713
BindingDB Entry DOI: 10.7270/Q2R2125K
Cytochrome P450 2A5
(Mus musculus)
BDBM50159267
(2-(4-methylphenyl)ethylamine | 2-p-Tolyl-ethylamin...)
Show SMILES Cc1ccc(CCN)cc1
Show InChI InChI=1S/C9H13N/c1-8-2-4-9(5-3-8)6-7-10/h2-5H,6-7,10H2,1H3
Reactome pathway
n/an/a 4.00E+3n/an/an/an/an/an/a
University of Kuopio
Curated by ChEMBL
Assay Description
Inhibitory concentration against mouse cytochrome P450 2A5
J Med Chem 48: 440-9 (2005)
Article DOI: 10.1021/jm049536b
BindingDB Entry DOI: 10.7270/Q20C4WJV
trace amine-associated receptor 1
(Homo sapiens (Human))
BDBM50159267
(2-(4-methylphenyl)ethylamine | 2-p-Tolyl-ethylamin...)
Show SMILES Cc1ccc(CCN)cc1
Show InChI InChI=1S/C9H13N/c1-8-2-4-9(5-3-8)6-7-10/h2-5H,6-7,10H2,1H3
Reactome pathway
n/an/an/an/a 4.38E+3n/an/an/an/a
RTI International
Curated by ChEMBL
Assay Description
Agonist activity at human trace amine associated receptor 1 expressed in RD-HGA16 CHO-K1 cells coexpressed with Galpha16 protein assessed as internal...
Bioorg Med Chem 16: 7415-23 (2008)
Article DOI: 10.1016/j.bmc.2008.06.009
BindingDB Entry DOI: 10.7270/Q2DR2V92