null
SMILES: COc1ccc(cc1)-c1nnc(o1)C(=O)N1CC(C1)Oc1ccc(CN2CCCC2)cc1
InChI Key: InChIKey=WYFUMSGPZNMEEQ-UHFFFAOYSA-N
Activity Spreadsheet -- Enzyme Inhibition Constant Data from BindingDB
Found 3 hits for monomerid = 50159340
Trg + Lig
Ki
nM
ΔG°
kcal/mole
IC50
nM
Kd
nM
EC50/IC50
nM
koff
s-1
kon
M-1s-1
pHTemp
°C
Melanin-concentrating hormone receptor 1
(Homo sapiens (Human))
BDBM50159340
(CHEMBL3786169)
Show SMILES COc1ccc(cc1)-c1nnc(o1)C(=O)N1CC(C1)Oc1ccc(CN2CCCC2)cc1
Show InChI InChI=1S/C24H26N4O4/c1-30-19-10-6-18(7-11-19)22-25-26-23(32-22)24(29)28-15-21(16-28)31-20-8-4-17(5-9-20)14-27-12-2-3-13-27/h4-11,21H,2-3,12-16H2,1H3
Reactome pathway
n/an/a 34n/an/an/an/an/an/a
AstraZeneca
Curated by ChEMBL
Assay Description
Antagonist activity at human MCHR1 expressed in CHO cell membranes preincubated for 5 mins followed by addition of MCH peptide measured after 45 mins...
J Med Chem 59: 2497-511 (2016)
BindingDB Entry DOI: 10.7270/Q23R0VSS
Potassium voltage-gated channel subfamily H member 2
(Homo sapiens (Human))
BDBM50159340
(CHEMBL3786169)
Show SMILES COc1ccc(cc1)-c1nnc(o1)C(=O)N1CC(C1)Oc1ccc(CN2CCCC2)cc1
Show InChI InChI=1S/C24H26N4O4/c1-30-19-10-6-18(7-11-19)22-25-26-23(32-22)24(29)28-15-21(16-28)31-20-8-4-17(5-9-20)14-27-12-2-3-13-27/h4-11,21H,2-3,12-16H2,1H3
Reactome pathway
n/an/a 5.50E+3n/an/an/an/an/an/a
AstraZeneca
Curated by ChEMBL
Assay Description
Inhibition of human ERG by IonWork assay
J Med Chem 59: 2497-511 (2016)
BindingDB Entry DOI: 10.7270/Q23R0VSS
Melanin-concentrating hormone receptor 1
(Mus musculus)
BDBM50159340
(CHEMBL3786169)
Show SMILES COc1ccc(cc1)-c1nnc(o1)C(=O)N1CC(C1)Oc1ccc(CN2CCCC2)cc1
Show InChI InChI=1S/C24H26N4O4/c1-30-19-10-6-18(7-11-19)22-25-26-23(32-22)24(29)28-15-21(16-28)31-20-8-4-17(5-9-20)14-27-12-2-3-13-27/h4-11,21H,2-3,12-16H2,1H3
Reactome pathway
n/an/a 6n/an/an/an/an/an/a
AstraZeneca
Curated by ChEMBL
Assay Description
Displacement of [125I]Tyr13-MCH from mouse MCHR1 after 60 mins by microbeta scintillation counting analysis
J Med Chem 59: 2497-511 (2016)
BindingDB Entry DOI: 10.7270/Q23R0VSS