BDBM50159355 CHEMBL3786647
SMILES: Cn1cc(Nc2nc(OC[C@H]3CN(C[C@@H]3CO)C(=O)C=C)c3c(Cl)c[nH]c3n2)cn1
InChI Key: InChIKey=BATDFQPFLIRBDO-VXGBXAGGSA-N
Data: 1 KI  2 IC50
Activity Spreadsheet -- Enzyme Inhibition Constant Data from BindingDB
Found 3 hits for monomerid = 50159355
Trg + Lig
Ki
nM
ΔG°
kcal/mole
IC50
nM
Kd
nM
EC50/IC50
nM
koff
s-1
kon
M-1s-1
pHTemp
°C
Epidermal growth factor receptor
(Homo sapiens (Human))
BDBM50159355
(CHEMBL3786647)
Show SMILES Cn1cc(Nc2nc(OC[C@H]3CN(C[C@@H]3CO)C(=O)C=C)c3c(Cl)c[nH]c3n2)cn1 |r|
Show InChI InChI=1S/C19H22ClN7O3/c1-3-15(29)27-6-11(9-28)12(7-27)10-30-18-16-14(20)5-21-17(16)24-19(25-18)23-13-4-22-26(2)8-13/h3-5,8,11-12,28H,1,6-7,9-10H2,2H3,(H2,21,23,24,25)/t11-,12-/m1/s1
15n/an/an/an/an/an/an/an/a
Pfizer Inc.
Curated by ChEMBL
Assay Description
Reversible binding affinity to human EGFR L858R/ T790M double mutant expressed in baculovirus by fluorometric analysis
J Med Chem 59: 2005-24 (2016)
BindingDB Entry DOI: 10.7270/Q2KS6TDD
Epidermal growth factor receptor
(Homo sapiens (Human))
BDBM50159355
(CHEMBL3786647)
Show SMILES Cn1cc(Nc2nc(OC[C@H]3CN(C[C@@H]3CO)C(=O)C=C)c3c(Cl)c[nH]c3n2)cn1 |r|
Show InChI InChI=1S/C19H22ClN7O3/c1-3-15(29)27-6-11(9-28)12(7-27)10-30-18-16-14(20)5-21-17(16)24-19(25-18)23-13-4-22-26(2)8-13/h3-5,8,11-12,28H,1,6-7,9-10H2,2H3,(H2,21,23,24,25)/t11-,12-/m1/s1
n/an/a>1.00E+4n/an/an/an/an/an/a
Pfizer Inc.
Curated by ChEMBL
Assay Description
Inhibition of EGF-stimulated wild type EGFR autophosphorylation expressed in human A549 cells by sandwich ELISA
J Med Chem 59: 2005-24 (2016)
BindingDB Entry DOI: 10.7270/Q2KS6TDD
Epidermal growth factor receptor
(Homo sapiens (Human))
BDBM50159355
(CHEMBL3786647)
Show SMILES Cn1cc(Nc2nc(OC[C@H]3CN(C[C@@H]3CO)C(=O)C=C)c3c(Cl)c[nH]c3n2)cn1 |r|
Show InChI InChI=1S/C19H22ClN7O3/c1-3-15(29)27-6-11(9-28)12(7-27)10-30-18-16-14(20)5-21-17(16)24-19(25-18)23-13-4-22-26(2)8-13/h3-5,8,11-12,28H,1,6-7,9-10H2,2H3,(H2,21,23,24,25)/t11-,12-/m1/s1
n/an/a 710n/an/an/an/an/an/a
Pfizer Inc.
Curated by ChEMBL
Assay Description
Inhibition of EGFR L858R/T790M double mutant autophosphorylation in human NCI-H1975 cells after 2 hrs by sandwich ELISA
J Med Chem 59: 2005-24 (2016)
BindingDB Entry DOI: 10.7270/Q2KS6TDD