BDBM50159450 CHEMBL386784::Des-AA1,2,4,5,13-[D-Trp8]-SRIF
SMILES: C[C@@H](O)[C@H]1NC(=O)[C@H](Cc2ccccc2)NC(=O)[C@H](NC(=O)[C@H](CCCCN)NC(=O)[C@H](Cc2c[nH]c3ccccc23)NC(=O)[C@H](Cc2ccccc2)NC(=O)[C@@H](Cc2ccccc2)NC(=O)[C@H](N)CSSC[C@H](NC1=O)C(O)=O)[C@@H](C)O
InChI Key: InChIKey=IHKVTDBEFCOKGW-FNLAWZLKSA-N
Data: 5 IC50
Activity Spreadsheet -- Enzyme Inhibition Constant Data from BindingDB
Found 5 hits for monomerid = 50159450
Trg + Lig
Ki
nM
ΔG°
kcal/mole
IC50
nM
Kd
nM
EC50/IC50
nM
koff
s-1
kon
M-1s-1
pHTemp
°C
Somatostatin receptor type 2
(Homo sapiens (Human))
BDBM50159450
(CHEMBL386784 | Des-AA1,2,4,5,13-[D-Trp8]-SRIF)
Show SMILES C[C@@H](O)[C@H]1NC(=O)[C@H](Cc2ccccc2)NC(=O)[C@H](NC(=O)[C@H](CCCCN)NC(=O)[C@H](Cc2c[nH]c3ccccc23)NC(=O)[C@H](Cc2ccccc2)NC(=O)[C@@H](Cc2ccccc2)NC(=O)[C@H](N)CSSC[C@H](NC1=O)C(O)=O)[C@@H](C)O
Show InChI InChI=1S/C58H73N11O12S2/c1-33(70)48-56(78)66-45(28-37-20-10-5-11-21-37)55(77)69-49(34(2)71)57(79)67-47(58(80)81)32-83-82-31-40(60)50(72)63-43(26-35-16-6-3-7-17-35)52(74)64-44(27-36-18-8-4-9-19-36)53(75)65-46(29-38-30-61-41-23-13-12-22-39(38)41)54(76)62-42(51(73)68-48)24-14-15-25-59/h3-13,16-23,30,33-34,40,42-49,61,70-71H,14-15,24-29,31-32,59-60H2,1-2H3,(H,62,76)(H,63,72)(H,64,74)(H,65,75)(H,66,78)(H,67,79)(H,68,73)(H,69,77)(H,80,81)/t33-,34-,40-,42+,43-,44+,45+,46+,47+,48-,49-/m1/s1
n/an/a 1.90n/an/an/an/an/an/a
Salk Institute
Curated by ChEMBL
Assay Description
Inhibition of 125I-[Leu8,D-Trp22,Tyr25]SRIF-28 binding to human somatostatin receptor type 2
J Med Chem 48: 515-22 (2005)
Article DOI: 10.1021/jm049519m
BindingDB Entry DOI: 10.7270/Q2QV3N9S
Somatostatin receptor type 3
(Homo sapiens (Human))
BDBM50159450
(CHEMBL386784 | Des-AA1,2,4,5,13-[D-Trp8]-SRIF)
Show SMILES C[C@@H](O)[C@H]1NC(=O)[C@H](Cc2ccccc2)NC(=O)[C@H](NC(=O)[C@H](CCCCN)NC(=O)[C@H](Cc2c[nH]c3ccccc23)NC(=O)[C@H](Cc2ccccc2)NC(=O)[C@@H](Cc2ccccc2)NC(=O)[C@H](N)CSSC[C@H](NC1=O)C(O)=O)[C@@H](C)O
Show InChI InChI=1S/C58H73N11O12S2/c1-33(70)48-56(78)66-45(28-37-20-10-5-11-21-37)55(77)69-49(34(2)71)57(79)67-47(58(80)81)32-83-82-31-40(60)50(72)63-43(26-35-16-6-3-7-17-35)52(74)64-44(27-36-18-8-4-9-19-36)53(75)65-46(29-38-30-61-41-23-13-12-22-39(38)41)54(76)62-42(51(73)68-48)24-14-15-25-59/h3-13,16-23,30,33-34,40,42-49,61,70-71H,14-15,24-29,31-32,59-60H2,1-2H3,(H,62,76)(H,63,72)(H,64,74)(H,65,75)(H,66,78)(H,67,79)(H,68,73)(H,69,77)(H,80,81)/t33-,34-,40-,42+,43-,44+,45+,46+,47+,48-,49-/m1/s1
Reactome pathway
n/an/a 52n/an/an/an/an/an/a
Salk Institute
Curated by ChEMBL
Assay Description
Inhibition of 125I-[Leu8,D-Trp22,Tyr25]SRIF-28 binding to human somatostatin receptor type 3
J Med Chem 48: 515-22 (2005)
Article DOI: 10.1021/jm049519m
BindingDB Entry DOI: 10.7270/Q2QV3N9S
Somatostatin receptor type 4
(Homo sapiens (Human))
BDBM50159450
(CHEMBL386784 | Des-AA1,2,4,5,13-[D-Trp8]-SRIF)
Show SMILES C[C@@H](O)[C@H]1NC(=O)[C@H](Cc2ccccc2)NC(=O)[C@H](NC(=O)[C@H](CCCCN)NC(=O)[C@H](Cc2c[nH]c3ccccc23)NC(=O)[C@H](Cc2ccccc2)NC(=O)[C@@H](Cc2ccccc2)NC(=O)[C@H](N)CSSC[C@H](NC1=O)C(O)=O)[C@@H](C)O
Show InChI InChI=1S/C58H73N11O12S2/c1-33(70)48-56(78)66-45(28-37-20-10-5-11-21-37)55(77)69-49(34(2)71)57(79)67-47(58(80)81)32-83-82-31-40(60)50(72)63-43(26-35-16-6-3-7-17-35)52(74)64-44(27-36-18-8-4-9-19-36)53(75)65-46(29-38-30-61-41-23-13-12-22-39(38)41)54(76)62-42(51(73)68-48)24-14-15-25-59/h3-13,16-23,30,33-34,40,42-49,61,70-71H,14-15,24-29,31-32,59-60H2,1-2H3,(H,62,76)(H,63,72)(H,64,74)(H,65,75)(H,66,78)(H,67,79)(H,68,73)(H,69,77)(H,80,81)/t33-,34-,40-,42+,43-,44+,45+,46+,47+,48-,49-/m1/s1
n/an/a 1n/an/an/an/an/an/a
Salk Institute
Curated by ChEMBL
Assay Description
Inhibition of 125I-[Leu8,D-Trp22,Tyr25]SRIF-28 binding to human somatostatin receptor type 4
J Med Chem 48: 515-22 (2005)
Article DOI: 10.1021/jm049519m
BindingDB Entry DOI: 10.7270/Q2QV3N9S
Somatostatin receptor type 1
(Homo sapiens (Human))
BDBM50159450
(CHEMBL386784 | Des-AA1,2,4,5,13-[D-Trp8]-SRIF)
Show SMILES C[C@@H](O)[C@H]1NC(=O)[C@H](Cc2ccccc2)NC(=O)[C@H](NC(=O)[C@H](CCCCN)NC(=O)[C@H](Cc2c[nH]c3ccccc23)NC(=O)[C@H](Cc2ccccc2)NC(=O)[C@@H](Cc2ccccc2)NC(=O)[C@H](N)CSSC[C@H](NC1=O)C(O)=O)[C@@H](C)O
Show InChI InChI=1S/C58H73N11O12S2/c1-33(70)48-56(78)66-45(28-37-20-10-5-11-21-37)55(77)69-49(34(2)71)57(79)67-47(58(80)81)32-83-82-31-40(60)50(72)63-43(26-35-16-6-3-7-17-35)52(74)64-44(27-36-18-8-4-9-19-36)53(75)65-46(29-38-30-61-41-23-13-12-22-39(38)41)54(76)62-42(51(73)68-48)24-14-15-25-59/h3-13,16-23,30,33-34,40,42-49,61,70-71H,14-15,24-29,31-32,59-60H2,1-2H3,(H,62,76)(H,63,72)(H,64,74)(H,65,75)(H,66,78)(H,67,79)(H,68,73)(H,69,77)(H,80,81)/t33-,34-,40-,42+,43-,44+,45+,46+,47+,48-,49-/m1/s1
n/an/a 197n/an/an/an/an/an/a
Salk Institute
Curated by ChEMBL
Assay Description
Inhibition of 125I-[Leu8,D-Trp22,Tyr25]SRIF-28 binding to human somatostatin receptor type 1
J Med Chem 48: 515-22 (2005)
Article DOI: 10.1021/jm049519m
BindingDB Entry DOI: 10.7270/Q2QV3N9S
Somatostatin receptor type 5
(Homo sapiens (Human))
BDBM50159450
(CHEMBL386784 | Des-AA1,2,4,5,13-[D-Trp8]-SRIF)
Show SMILES C[C@@H](O)[C@H]1NC(=O)[C@H](Cc2ccccc2)NC(=O)[C@H](NC(=O)[C@H](CCCCN)NC(=O)[C@H](Cc2c[nH]c3ccccc23)NC(=O)[C@H](Cc2ccccc2)NC(=O)[C@@H](Cc2ccccc2)NC(=O)[C@H](N)CSSC[C@H](NC1=O)C(O)=O)[C@@H](C)O
Show InChI InChI=1S/C58H73N11O12S2/c1-33(70)48-56(78)66-45(28-37-20-10-5-11-21-37)55(77)69-49(34(2)71)57(79)67-47(58(80)81)32-83-82-31-40(60)50(72)63-43(26-35-16-6-3-7-17-35)52(74)64-44(27-36-18-8-4-9-19-36)53(75)65-46(29-38-30-61-41-23-13-12-22-39(38)41)54(76)62-42(51(73)68-48)24-14-15-25-59/h3-13,16-23,30,33-34,40,42-49,61,70-71H,14-15,24-29,31-32,59-60H2,1-2H3,(H,62,76)(H,63,72)(H,64,74)(H,65,75)(H,66,78)(H,67,79)(H,68,73)(H,69,77)(H,80,81)/t33-,34-,40-,42+,43-,44+,45+,46+,47+,48-,49-/m1/s1
Reactome pathway
n/an/a 43n/an/an/an/an/an/a
Salk Institute
Curated by ChEMBL
Assay Description
Inhibition of 125I-[Leu8,D-Trp22,Tyr25]SRIF-28 binding to human somatostatin receptor type 5
J Med Chem 48: 515-22 (2005)
Article DOI: 10.1021/jm049519m
BindingDB Entry DOI: 10.7270/Q2QV3N9S