BDBM50159551 CHEMBL3786730
SMILES: [Cl-].COc1c(NC(=O)C(=O)c2ccc(OCCN3CCOCC3)c3ccccc23)cc(cc1NS(=O)(=O)C[N+]12CCN(CC1)CC2)C(C)(C)C
InChI Key: InChIKey=PBJYTTMYXWFHQO-UHFFFAOYSA-N
Data: 1 IC50
Activity Spreadsheet -- Enzyme Inhibition Constant Data from BindingDB
Found 1 hit for monomerid = 50159551
Trg + Lig
Ki
nM
ΔG°
kcal/mole
IC50
nM
Kd
nM
EC50/IC50
nM
koff
s-1
kon
M-1s-1
pHTemp
°C
Scavenger receptor class B member 1
(Homo sapiens (Human))
BDBM50159551
(CHEMBL3786730)
Show SMILES [Cl-].COc1c(NC(=O)C(=O)c2ccc(OCCN3CCOCC3)c3ccccc23)cc(cc1NS(=O)(=O)C[N+]12CCN(CC1)CC2)C(C)(C)C
Show InChI InChI=1S/C36H47N5O7S.ClH/c1-36(2,3)26-23-30(34(46-4)31(24-26)38-49(44,45)25-41-17-11-39(12-18-41)13-19-41)37-35(43)33(42)29-9-10-32(28-8-6-5-7-27(28)29)48-22-16-40-14-20-47-21-15-40;/h5-10,23-24,38H,11-22,25H2,1-4H3;1H
n/an/a 158n/an/an/an/an/an/a
GlaxoSmithKline
Curated by ChEMBL
Assay Description
Inhibition of human SR-B1 transiently expressed in human U2OS cells assessed as Dil-HDL uptake preincubated for 2 hrs followed by Dil-HDL addition me...
Bioorg Med Chem Lett 26: 1901-4 (2016)
BindingDB Entry DOI: 10.7270/Q22R3TJ2