BDBM50159798 CHEMBL182856::Sodium; L-Malate
SMILES: OC(CC([O-])=O)C([O-])=O
InChI Key: InChIKey=BJEPYKJPYRNKOW-UHFFFAOYSA-L
Data: 5 KI
Activity Spreadsheet -- Enzyme Inhibition Constant Data from BindingDB
Found 5 hits for monomerid = 50159798
Trg + Lig
Ki
nM
ΔG°
kcal/mole
IC50
nM
Kd
nM
EC50/IC50
nM
koff
s-1
kon
M-1s-1
pHTemp
°C
Carbonic anhydrase 4
(Homo sapiens (Human))
BDBM50159798
(CHEMBL182856 | Sodium; L-Malate)
Show SMILES OC(CC([O-])=O)C([O-])=O
Show InChI InChI=1S/C4H6O5/c5-2(4(8)9)1-3(6)7/h2,5H,1H2,(H,6,7)(H,8,9)/p-2
Reactome pathway
5.37E+4n/an/an/an/an/an/an/an/a
Università degli Studi di Firenze
Curated by ChEMBL
Assay Description
Binding affinity against human cytosolic Carbonic anhydrase IV
Bioorg Med Chem Lett 15: 573-8 (2005)
Article DOI: 10.1016/j.bmcl.2004.11.057
BindingDB Entry DOI: 10.7270/Q2TH8M6D
β-Carbonic anhydrase (CA1)
(Flaveria bidentis (Coastal plain yellowtops))
BDBM50159798
(CHEMBL182856 | Sodium; L-Malate)
Show SMILES OC(CC([O-])=O)C([O-])=O
Show InChI InChI=1S/C4H6O5/c5-2(4(8)9)1-3(6)7/h2,5H,1H2,(H,6,7)(H,8,9)/p-2
9.25E+4 -5.41n/an/an/an/an/a8.320
Istituto di Biostrutture e Bioimmagini-CNR
Assay Description
Inhibition constants of carboxylate inhibitors against F. bidentis CA I were determined by a stopped flow CO2 hydration assay at 20 °C.
J Enzyme Inhib Med Chem 29: 500-4 (2014)
Article DOI: 10.3109/14756366.2013.813942
BindingDB Entry DOI: 10.7270/Q2WD3ZGT
Carbonic anhydrase 2
(Homo sapiens (Human))
BDBM50159798
(CHEMBL182856 | Sodium; L-Malate)
Show SMILES OC(CC([O-])=O)C([O-])=O
Show InChI InChI=1S/C4H6O5/c5-2(4(8)9)1-3(6)7/h2,5H,1H2,(H,6,7)(H,8,9)/p-2
Reactome pathway
1.87E+6n/an/an/an/an/an/an/an/a
Università degli Studi di Firenze
Curated by ChEMBL
Assay Description
Binding affinity against human cytosolic Carbonic anhydrase II
Bioorg Med Chem Lett 15: 573-8 (2005)
Article DOI: 10.1016/j.bmcl.2004.11.057
BindingDB Entry DOI: 10.7270/Q2TH8M6D
Carbonic Anhydrase VA
(Homo sapiens (Human))
BDBM50159798
(CHEMBL182856 | Sodium; L-Malate)
Show SMILES OC(CC([O-])=O)C([O-])=O
Show InChI InChI=1S/C4H6O5/c5-2(4(8)9)1-3(6)7/h2,5H,1H2,(H,6,7)(H,8,9)/p-2
Reactome pathway
2.49E+6n/an/an/an/an/an/an/an/a
Università degli Studi di Firenze
Curated by ChEMBL
Assay Description
Binding affinity against human cytosolic Carbonic anhydrase V
Bioorg Med Chem Lett 15: 573-8 (2005)
Article DOI: 10.1016/j.bmcl.2004.11.057
BindingDB Entry DOI: 10.7270/Q2TH8M6D
Carbonic anhydrase 9
(Homo sapiens (Human))
BDBM50159798
(CHEMBL182856 | Sodium; L-Malate)
Show SMILES OC(CC([O-])=O)C([O-])=O
Show InChI InChI=1S/C4H6O5/c5-2(4(8)9)1-3(6)7/h2,5H,1H2,(H,6,7)(H,8,9)/p-2
NCI pathway
Reactome pathway
7.42E+6n/an/an/an/an/an/an/an/a
Università degli Studi di Firenze
Curated by ChEMBL
Assay Description
Binding affinity against human cytosolic Carbonic anhydrase IX
Bioorg Med Chem Lett 15: 573-8 (2005)
Article DOI: 10.1016/j.bmcl.2004.11.057
BindingDB Entry DOI: 10.7270/Q2TH8M6D