BDBM50159902 1-{1-[3-(2-Chloro-5-methyl-phenoxy)-3-phenyl-propyl]-piperidin-4-yl}-1,3-dihydro-benzoimidazol-2-one::CHEMBL182819
SMILES: Cc1ccc(Cl)c(OC(CCN2CCC(CC2)n2c3ccccc3[nH]c2=O)c2ccccc2)c1
InChI Key: InChIKey=KIMJEJSRLGDDLS-UHFFFAOYSA-N
Data: 2 KI  1 IC50
Activity Spreadsheet -- Enzyme Inhibition Constant Data from BindingDB
Found 3 hits for monomerid = 50159902
Trg + Lig
Ki
nM
ΔG°
kcal/mole
IC50
nM
Kd
nM
EC50/IC50
nM
koff
s-1
kon
M-1s-1
pHTemp
°C
Nociceptin receptor
(Homo sapiens (Human))
BDBM50159902
(1-{1-[3-(2-Chloro-5-methyl-phenoxy)-3-phenyl-propy...)
Show SMILES Cc1ccc(Cl)c(OC(CCN2CCC(CC2)n2c3ccccc3[nH]c2=O)c2ccccc2)c1
Show InChI InChI=1S/C28H30ClN3O2/c1-20-11-12-23(29)27(19-20)34-26(21-7-3-2-4-8-21)15-18-31-16-13-22(14-17-31)32-25-10-6-5-9-24(25)30-28(32)33/h2-12,19,22,26H,13-18H2,1H3,(H,30,33)
Reactome pathway
8.30n/an/an/an/an/an/an/an/a
Organon Laboratories Ltd
Curated by ChEMBL
Assay Description
Binding affinity towards human opioid receptor like 1 was determined by using [3H]-nociceptin as radioligand expressed in Chinese hamster ovary (CHO)...
Bioorg Med Chem Lett 15: 589-93 (2005)
Article DOI: 10.1016/j.bmcl.2004.11.049
BindingDB Entry DOI: 10.7270/Q2K35T50
Mu-type opioid receptor
(Homo sapiens (Human))
BDBM50159902
(1-{1-[3-(2-Chloro-5-methyl-phenoxy)-3-phenyl-propy...)
Show SMILES Cc1ccc(Cl)c(OC(CCN2CCC(CC2)n2c3ccccc3[nH]c2=O)c2ccccc2)c1
Show InChI InChI=1S/C28H30ClN3O2/c1-20-11-12-23(29)27(19-20)34-26(21-7-3-2-4-8-21)15-18-31-16-13-22(14-17-31)32-25-10-6-5-9-24(25)30-28(32)33/h2-12,19,22,26H,13-18H2,1H3,(H,30,33)
NCI pathway
Reactome pathway
16.7n/an/an/an/an/an/an/an/a
Organon Laboratories Ltd
Curated by ChEMBL
Assay Description
Binding affinity towards human opioid receptor mu 1 was determined by using [3H]-diprenorphine as radioligand expressed in Chinese hamster ovary (CHO...
Bioorg Med Chem Lett 15: 589-93 (2005)
Article DOI: 10.1016/j.bmcl.2004.11.049
BindingDB Entry DOI: 10.7270/Q2K35T50
Nociceptin receptor
(Homo sapiens (Human))
BDBM50159902
(1-{1-[3-(2-Chloro-5-methyl-phenoxy)-3-phenyl-propy...)
Show SMILES Cc1ccc(Cl)c(OC(CCN2CCC(CC2)n2c3ccccc3[nH]c2=O)c2ccccc2)c1
Show InChI InChI=1S/C28H30ClN3O2/c1-20-11-12-23(29)27(19-20)34-26(21-7-3-2-4-8-21)15-18-31-16-13-22(14-17-31)32-25-10-6-5-9-24(25)30-28(32)33/h2-12,19,22,26H,13-18H2,1H3,(H,30,33)
Reactome pathway
n/an/a 240n/an/an/an/an/an/a
Organon Laboratories Ltd
Curated by ChEMBL
Assay Description
Inhibitory concentration measured by cellular decreases in forskolin stimulated cAMP in CHO cells stably transfected with hORL1 receptor
Bioorg Med Chem Lett 15: 589-93 (2005)
Article DOI: 10.1016/j.bmcl.2004.11.049
BindingDB Entry DOI: 10.7270/Q2K35T50