BDBM50160000 CHEMBL3786018::US10093640, Example 89::US10844032, Example 89
SMILES: Cc1ccncc1-c1cccc2c(CCCOc3cc(C)c(Cl)c(C)c3)c([nH]c12)C(=O)NS(=O)(=O)c1ccccc1
InChI Key: InChIKey=JDLPWUZBGRFKAE-UHFFFAOYSA-N
Data: 2 KI  1 IC50
Activity Spreadsheet -- Enzyme Inhibition Constant Data from BindingDB
Found 3 hits for monomerid = 50160000
Trg + Lig
Ki
nM
ΔG°
kcal/mole
IC50
nM
Kd
nM
EC50/IC50
nM
koff
s-1
kon
M-1s-1
pHTemp
°C
Induced myeloid leukemia cell differentiation protein Mcl-1
(Homo sapiens (Human))
BDBM50160000
(CHEMBL3786018 | US10093640, Example 89 | US1084403...)
Show SMILES Cc1ccncc1-c1cccc2c(CCCOc3cc(C)c(Cl)c(C)c3)c([nH]c12)C(=O)NS(=O)(=O)c1ccccc1
Show InChI InChI=1S/C32H30ClN3O4S/c1-20-14-15-34-19-28(20)27-12-7-11-25-26(13-8-16-40-23-17-21(2)29(33)22(3)18-23)31(35-30(25)27)32(37)36-41(38,39)24-9-5-4-6-10-24/h4-7,9-12,14-15,17-19,35H,8,13,16H2,1-3H3,(H,36,37)
NCI pathway
36n/an/an/an/an/an/an/an/a
Vanderbilt University School of Medicine
Curated by ChEMBL
Assay Description
Displacement of FITC-Bak-BH3 peptide probe from N-terminal His-tagged human Mcl-1 (172 to 327 residues) expressed in Escherichia coli BL21(DE3) after...
J Med Chem 59: 2054-66 (2016)
BindingDB Entry DOI: 10.7270/Q2F191MW
Induced myeloid leukemia cell differentiation protein Mcl-1 (aa 172-327)
(Homo sapiens (Human))
BDBM50160000
(CHEMBL3786018 | US10093640, Example 89 | US1084403...)
Show SMILES Cc1ccncc1-c1cccc2c(CCCOc3cc(C)c(Cl)c(C)c3)c([nH]c12)C(=O)NS(=O)(=O)c1ccccc1
Show InChI InChI=1S/C32H30ClN3O4S/c1-20-14-15-34-19-28(20)27-12-7-11-25-26(13-8-16-40-23-17-21(2)29(33)22(3)18-23)31(35-30(25)27)32(37)36-41(38,39)24-9-5-4-6-10-24/h4-7,9-12,14-15,17-19,35H,8,13,16H2,1-3H3,(H,36,37)
US Patent
<100n/an/an/an/an/an/an/an/a
Vanderbilt University
US Patent
Assay Description
The assay was run using a fluorescein isothiocyanate-labeled BH3 peptide derived from Bak (FITC-AHx-GQVGRQLAIIGDDINR-NH2) that was purchased from Gen...
US Patent US10844032 (2020)
Induced myeloid leukemia cell differentiation protein Mcl-1
(Homo sapiens (Human))
BDBM50160000
(CHEMBL3786018 | US10093640, Example 89 | US1084403...)
Show SMILES Cc1ccncc1-c1cccc2c(CCCOc3cc(C)c(Cl)c(C)c3)c([nH]c12)C(=O)NS(=O)(=O)c1ccccc1
Show InChI InChI=1S/C32H30ClN3O4S/c1-20-14-15-34-19-28(20)27-12-7-11-25-26(13-8-16-40-23-17-21(2)29(33)22(3)18-23)31(35-30(25)27)32(37)36-41(38,39)24-9-5-4-6-10-24/h4-7,9-12,14-15,17-19,35H,8,13,16H2,1-3H3,(H,36,37)
NCI pathway
US Patent
n/an/a<100n/an/an/an/a7.525
Novartis AG
US Patent
Assay Description
Compound affinity was measured using a fluorescence polarization anisotropy competition assay. Anisotropy measurements were carried out in 384-well, ...
US Patent US10093646 (2018)
BindingDB Entry DOI: 10.7270/Q29P33PN